program: Gaussian 09
title: 000074130
version: EM64L-G09RevD.01
frameworkgroup: C1[X(C11H16NO5PS)]
method: RPBEPBE
basis: SDD
operation: Freq
keyword: #p
keyword: freq=noraman
keyword: PBEPBE/SDD
title: #p freq=noraman PBEPBE/SDD
converged: YES YES NO NO
title: Mulliken charges:
elementType: S P O O O O O N C C C C C C C C C C C H H H H H H H H H H H H H H H H
charge: -0.202806 0.866117 -0.491862 -0.455549 -0.465202 -0.208619 -0.210562 0.008245 -0.202254 0.478067 0.166010 -0.686108 -0.714592 -0.456236 0.359321 -0.342108 -0.377562 -0.477250 -0.476397 0.249937 0.215153 0.216011 0.249586 0.228606 0.226393 0.203526 0.271692 0.283876 0.266091 0.249673 0.243171 0.245038 0.250768 0.240842 0.248982
chargesum: 0.00000
title: Mulliken charges with hydrogens summed into heavy atoms:
elementType: S P O O O O O N C C C C C C C C C C C
charge: -0.202806 0.866117 -0.491862 -0.455549 -0.465202 -0.208619 -0.210562 0.008245 0.047683 0.478067 0.166010 -0.005358 -0.056067 -0.184543 0.359321 -0.058232 -0.111470 0.260631 0.264194
polarizability: 2.55906965e+02 -1.28993230e+00 1.94891314e+02 4.12230053e+00 9.87502306e+00 1.40377438e+02
1716.lowfreq: -4.0840 -0.0026 -0.0021 -0.0019 3.6889 7.2520 18.2823 29.7017 39.4145
frequency: 16.0013 29.4857 39.3942 43.8516 48.4755 77.4024 83.6224 95.3905 109.1891 114.2009 122.2533 128.3218 151.5613 189.1606 197.1210 217.3970 224.2328 232.7832 247.9172 274.4079 286.5006 290.0997 324.2502 343.5726 367.0969 388.2714 424.4503 430.1507 451.3227 489.2313 540.0960 553.8472 595.7287 627.9893 661.8861 672.9827 689.8590 695.3603 740.1365 746.0269 781.6172 838.8693 870.5923 894.4389 921.8725 930.4586 956.3726 961.4936 971.5205 973.6930 1048.4387 1087.8414 1106.3969 1113.9717 1114.3747 1124.6419 1132.0473 1133.4330 1151.3908 1177.9882 1204.7459 1224.5344 1273.8385 1286.6930 1325.1166 1356.7115 1376.9811 1392.2487 1398.4131 1421.7735 1423.7143 1425.0599 1456.8902 1457.5320 1461.5707 1465.8670 1468.8499 1470.0308 1472.4268 1488.8528 1489.5293 1576.4868 1603.8368 2977.7434 2980.9433 2988.1458 2989.1277 3036.8501 3069.2882 3079.8640 3083.0656 3095.0581 3096.5644 3100.1698 3137.3371 3138.7563 3171.3926 3173.3710 3191.9503
redmass: 4.9927 5.6550 4.1554 4.8306 3.4345 3.8929 5.1372 3.6322 1.1303 1.1613 3.9347 3.5033 3.9200 4.2722 3.3938 3.2755 5.2240 1.7965 1.0767 7.2365 5.9226 4.4723 3.8889 3.9579 6.8267 6.4081 4.1424 5.5194 3.7224 7.7691 4.3906 5.8482 5.2299 4.5568 7.6809 5.6885 10.6866 12.7675 5.6774 4.4807 10.4421 1.4920 3.1019 1.5324 1.2215 2.9775 11.3365 1.3967 4.1292 1.6771 4.2404 1.5586 2.7697 1.2406 1.2427 2.1522 1.3023 1.2991 1.4026 2.2571 4.8419 3.4960 1.5371 1.3850 2.0852 2.9070 1.2670 4.7125 1.3489 2.7613 1.1366 1.1291 1.0553 1.0515 1.3588 1.1739 1.0523 1.0586 1.3556 1.0783 1.0720 7.6489 6.6163 1.0358 1.0357 1.0302 1.0303 1.0847 1.0991 1.0985 1.1002 1.1047 1.1046 1.0994 1.1037 1.1038 1.0905 1.0885 1.0978
irintensity: 0.3391 0.1029 0.5648 2.9917 2.2014 3.5860 2.6286 5.3389 0.1716 0.4354 0.8671 3.0088 3.4756 2.8231 0.7280 5.6700 8.4233 1.5443 0.5566 8.7774 5.1282 9.6649 1.3169 3.0063 9.5062 7.8590 1.6089 9.9719 3.1455 13.2067 1.6697 25.9726 23.7235 2.8481 123.4469 8.0507 86.0668 165.2605 95.1588 42.0418 23.0291 40.3721 73.9736 25.1835 9.8722 186.7015 228.1073 1.9880 90.0755 20.0248 12.1201 18.0789 7.5707 0.6469 0.4113 4.3951 0.4131 0.5855 8.4878 231.8867 432.4751 2.1377 6.9362 26.0302 43.7464 79.6954 15.2805 10.9290 13.8352 48.4111 2.8730 10.6211 7.7923 17.0128 38.6009 8.0091 21.4099 8.3012 20.2652 25.0238 12.6337 78.6591 179.1494 21.4445 27.1475 48.2410 36.5249 2.8246 7.9875 60.4597 33.9592 20.4391 21.0653 17.8236 12.1851 9.3729 2.6932 0.5336 2.4523
temp: 298.150 k
press: 1.00000 atm
elementType: 16 15 8 8 8 8 8 7 6 6 6 6 6 6 6 6 6 6 6 1 1 1 1 1 1 1 1 1 1 1 1 1 1 1 1
symmnumber: 1
zpe: 688354.1 jmol-1
zpe.correction: 0.262180 hartree
zpe.thermalcorrener: 0.284392 hartree
zpe.thermalcorrenthalpy: 0.285336 hartree
zpe.thermalcorrgfe: 0.208095 hartree
zpe.sumelectzpe: -1597.373355 hartree
zpe.sumelectthermal: -1597.351144 hartree
zpe.sumelectthermalent: -1597.350200 hartree
zpe.sumelectthermalfe: -1597.427441 hartree
dipole: -6.5625 1.2072 -0.5678
dipole: 6.6967
quadrupole: -139.9662 -111.7708 -134.8489
quadrupole: 7.6070 -1.9467 -7.0164
quadrupole: -11.1043 17.0912 -5.9869 7.6070 -1.9467 -7.0164
hfenergy: -1597.6355357 hartree
pointgroup: C01 [X(C11H16N1O5P1S1)]
dipole: 2.5853434 0.4579867 0.2187895 debye
polarizability: 255.9127775|0.8836779|194.5068112|4.1824298|-10.8647775|140.756129 unknown
InChI: InChI=1S/C11H16NO5PS/c1-8(2)10-7-9(5-6-11(10)12(13)14)17-18(19,15-3)16-4/h5-8H,1-4H3
charge 0 multiplicity 1
35 atoms
S  2.887113 0.529537 -2.042088
P  2.99488 -0.04404 -0.069556
O  1.782113 -1.141168 0.549937
O  4.393524 -0.895422 0.450539
O  2.895871 1.169444 1.144976
O  -4.487208 -1.805607 0.306818
O  -4.405926 0.212729 -0.741712
N  -3.835612 -0.776744 -0.13198
C  -2.193933 1.864181 -0.009448
C  -1.608463 0.451447 0.101251
C  -2.366756 -0.759069 0.054769
C  -2.130421 2.337206 -1.490816
C  -1.496297 2.884627 0.923439
C  -0.209349 0.303264 0.271976
C  0.393851 -0.966651 0.362942
C  -1.763834 -2.036325 0.1885
C  -0.375468 -2.151805 0.327375
C  4.971008 -1.933558 -0.438274
C  3.783913 2.353927 1.02615
H  -3.260739 1.822618 0.26839
H  -1.084567 2.369497 -1.849235
H  -2.559535 3.351908 -1.580292
H  -2.708329 1.661059 -2.142486
H  -1.46197 2.529194 1.969124
H  -2.057634 3.836258 0.902655
H  -0.463213 3.112266 0.600668
H  0.415521 1.196032 0.359475
H  -2.404034 -2.92177 0.169741
H  0.117705 -3.123474 0.409225
H  5.968711 -2.130405 -0.020347
H  5.051903 -1.561076 -1.475883
H  4.351289 -2.845558 -0.403024
H  3.422084 3.046047 1.799921
H  3.692778 2.812064 0.024246
H  4.829023 2.063866 1.226523
