program: Orca
programVersion: 4.2.1
elementType: Cl S O O O O O O N N N N C C C C C C C C C C C C C C C H H H H H H H H H H H H H H H
charge: 0
multiplicity: 1
keywords: wb97x-d3
keywords: def2-TZVPP
keywords: def2/J RIJCOSX GRIDX6 NOFINALGRIDX
keywords: grid4 nofinalgrid
keywords: scfconv7
keywords: smallprint printgap noloewdin
keywords: NOSOSCF
formula: C15H15ClN4O6S
InChI: InChI=1S/C15H15ClN4O6S/c1-3-26-13(21)9-6-4-5-7-10(9)27(23,24)20-15(22)19-14-17-11(16)8-12(18-14)25-2/h4-8,19-20H,3H2,1-2H3
42 atoms
Cl -3.222109 1.057898 2.007474
S  1.257079 -2.017888 0.673954
O  1.476591 1.090814 1.366844
O  1.217675 -3.398664 0.246117
O  0.990647 -1.683442 2.060104
O  3.034038 0.827907 2.962462
O  0.841767 -1.755323 -2.240892
O  -4.902549 1.815928 -2.63903
N  0.118826 -1.149253 -0.177651
N  -1.020643 -0.494499 -2.097395
N  -2.957166 0.663026 -2.36752
N  -2.112534 0.283031 -0.198058
C  2.83095 -1.34091 0.216112
C  3.33799 -0.20767 0.854191
C  3.595826 -2.051337 -0.697033
C  4.632431 0.197134 0.557649
C  4.875435 -1.614977 -1.001751
C  5.391977 -0.493157 -0.375171
C  2.593809 0.604725 1.865416
C  0.038041 -1.180549 -1.541404
C  0.603207 1.871743 2.205799
C  -2.067796 0.174373 -1.515332
C  -0.022972 2.954105 1.365275
C  -3.985293 1.304101 -1.851841
C  -4.154668 1.471723 -0.467726
C  -3.159996 0.926382 0.295298
C  -4.754442 1.676823 -4.052501
H  3.21036 -2.945214 -1.164682
H  5.047646 1.066172 1.0506
H  -0.586908 -0.621002 0.348245
H  5.46926 -2.164548 -1.718985
H  6.394284 -0.156166 -0.602288
H  -1.045883 -0.528243 -3.108478
H  1.158543 2.302614 3.037865
H  -0.147201 1.194208 2.617777
H  -0.55809 2.551377 0.506097
H  -0.735806 3.511033 1.97315
H  0.727229 3.65822 1.004602
H  -5.002762 1.994434 -0.052648
H  -3.848701 2.167408 -4.408459
H  -5.622944 2.164887 -4.485725
H  -4.740758 0.629267 -4.352161
elementType: Cl S O N C H
totalener: -2109.58733515 hartree
nucrepener: 3000.16568280 hartree
electener: -5109.75301795 hartree
oneelecener: -8862.79232812 hartree
twoeener: 3753.03931017 hartree
cpcmener: -0.04133769 hartree
kineticenergy: 2103.04121625 hartree
xcener: -155.810749820328 hartree
chargesum: -0.0000000
charge: -0.047173 0.882292 -0.264398 -0.491336 -0.506523 -0.426860 -0.459458 -0.277924 -0.186883 -0.136892 -0.408662 -0.386570 -0.149390 0.071450 0.002922 -0.202441 -0.168669 -0.106102 0.452344 0.381370 0.017705 0.415543 -0.258592 0.389763 -0.211197 0.179295 -0.115530 0.141114 0.147598 0.192096 0.165195 0.165905 0.192145 0.110844 0.098523 0.081097 0.095799 0.104240 0.148542 0.117927 0.133671 0.117217
qa: -0.0472 0.8823 -0.2644 -0.4913 -0.5065 -0.4269 -0.4595 -0.2779 -0.1869 -0.1369 -0.4087 -0.3866 -0.1494 0.0715 0.0029 -0.2024 -0.1687 -0.1061 0.4523 0.3814 0.0177 0.4155 -0.2586 0.3898 -0.2112 0.1793 -0.1155 0.1411 0.1476 0.1921 0.1652 0.1659 0.1921 0.1108 0.0985 0.0811 0.0958 0.1042 0.1485 0.1179 0.1337 0.1172
va: 1.2607 5.8108 2.1110 2.0165 1.9800 2.0811 2.0617 2.1593 3.0828 3.1849 2.9925 2.9672 3.8280 3.6856 3.8454 4.0259 3.9552 3.8988 4.1247 4.4026 3.7820 4.1644 3.9428 4.0830 3.9784 4.1356 3.8416 1.0269 1.0084 1.0818 0.9883 0.9867 1.0169 1.0213 1.0109 1.0027 1.0073 1.0089 1.0100 0.9947 0.9934 0.9948
dispcorr: -0.025096822 hartree
energy: -2109.612431972771
dipole: 3.97391 -5.83620 -1.86228 13.11757 -10.04368 3.07389 -11.30209 8.32777 -2.97431
magnitude: 4.66513 au
magnitude: 11.85782 debye
