program: Orca
programVersion: 4.2.1
elementType: Cl S O O O O O O N N N N C C C C C C C C C C C C C C C H H H H H H H H H H H H H H H
charge: 0
multiplicity: 1
keywords: wb97x-d3
keywords: def2-TZVPP
keywords: def2/J RIJCOSX GRIDX6 NOFINALGRIDX
keywords: grid4 nofinalgrid
keywords: scfconv7
keywords: smallprint printgap noloewdin
keywords: NOSOSCF
formula: C15H15ClN4O6S
InChI: InChI=1S/C15H15ClN4O6S/c1-3-26-13(21)9-6-4-5-7-10(9)27(23,24)20-15(22)19-14-17-11(16)8-12(18-14)25-2/h4-8,19-20H,3H2,1-2H3
42 atoms
Cl -3.318792 1.073626 2.016264
S  1.319311 -1.929425 0.819736
O  1.355392 1.179242 1.031192
O  1.313468 -3.349836 0.544413
O  1.135448 -1.464733 2.180075
O  3.163148 1.627785 2.268993
O  0.799322 -1.919371 -2.075276
O  -4.826844 1.799449 -2.689773
N  0.084723 -1.213944 -0.042841
N  -1.049066 -0.635066 -1.99212
N  -2.930819 0.586314 -2.338429
N  -2.158334 0.225524 -0.137634
C  2.832698 -1.255265 0.172816
C  3.31912 -0.002832 0.561185
C  3.592312 -2.096949 -0.626374
C  4.58518 0.374259 0.128997
C  4.842098 -1.690063 -1.0663
C  5.33855 -0.455566 -0.686872
C  2.603305 1.00205 1.40548
C  0.000867 -1.305474 -1.402749
C  0.557079 2.151205 1.734707
C  -2.082283 0.08715 -1.450638
C  0.113243 1.682607 3.100441
C  -3.950863 1.271911 -1.866355
C  -4.154911 1.470825 -0.491869
C  -3.199793 0.91077 0.31028
C  -4.642135 1.629235 -4.095189
H  3.225657 -3.074131 -0.902943
H  4.983329 1.335464 0.424479
H  -0.604996 -0.648128 0.462262
H  5.425983 -2.348591 -1.694426
H  6.317037 -0.135149 -1.017833
H  -1.066011 -0.709402 -3.001177
H  -0.2994 2.308225 1.081547
H  1.102999 3.093995 1.797246
H  -0.426002 0.738299 3.05214
H  0.945628 1.571888 3.793208
H  -0.563682 2.430153 3.515572
H  -4.998409 2.025726 -0.110705
H  -3.708368 2.079149 -4.431922
H  -5.478349 2.141244 -4.562963
H  -4.65913 0.576633 -4.376647
elementType: Cl S O N C H
totalener: -2109.58651187 hartree
nucrepener: 3006.71704895 hartree
electener: -5116.30356083 hartree
oneelecener: -8875.93088764 hartree
twoeener: 3759.62732681 hartree
cpcmener: -0.04007267 hartree
kineticenergy: 2103.04103550 hartree
xcener: -155.811798147890 hartree
chargesum: -0.0000000
charge: -0.046986 0.884120 -0.270117 -0.495984 -0.501977 -0.432891 -0.458845 -0.278602 -0.183987 -0.136808 -0.410117 -0.384292 -0.185128 0.082242 0.009353 -0.193737 -0.164127 -0.108986 0.468744 0.374158 0.007533 0.414547 -0.267973 0.392603 -0.227570 0.188628 -0.115312 0.144363 0.144995 0.198936 0.164811 0.164787 0.191597 0.107926 0.112593 0.072798 0.109149 0.111064 0.150499 0.117391 0.133573 0.117031
qa: -0.0470 0.8841 -0.2701 -0.4960 -0.5020 -0.4329 -0.4588 -0.2786 -0.1840 -0.1368 -0.4101 -0.3843 -0.1851 0.0822 0.0094 -0.1937 -0.1641 -0.1090 0.4687 0.3742 0.0075 0.4145 -0.2680 0.3926 -0.2276 0.1886 -0.1153 0.1444 0.1450 0.1989 0.1648 0.1648 0.1916 0.1079 0.1126 0.0728 0.1091 0.1111 0.1505 0.1174 0.1336 0.1170
va: 1.2618 5.8082 2.1138 2.0072 1.9866 2.0687 2.0626 2.1581 3.0839 3.1854 2.9912 2.9731 3.8566 3.6469 3.8243 4.0250 3.9569 3.9090 4.0941 4.4118 3.8166 4.1707 3.8844 4.0742 3.9811 4.1387 3.8422 1.0256 1.0149 1.0716 0.9884 0.9877 1.0176 1.0005 1.0120 1.0156 1.0192 1.0046 1.0096 0.9949 0.9934 0.9949
dispcorr: -0.025475924 hartree
energy: -2109.611987798491
dipole: 4.47967 -6.42965 -1.94998 9.73957 -7.11234 2.62723 -8.25864 5.24941 -3.00923
magnitude: 4.44525 au
magnitude: 11.29892 debye
