program: Orca
programVersion: 4.2.1
elementType: Cl S O O O O O O N N N N C C C C C C C C C C C C C C C H H H H H H H H H H H H H H H
charge: 0
multiplicity: 1
keywords: wb97x-d3
keywords: def2-TZVPP
keywords: def2/J RIJCOSX GRIDX6 NOFINALGRIDX
keywords: grid4 nofinalgrid
keywords: scfconv7
keywords: smallprint printgap noloewdin
keywords: NOSOSCF
formula: C15H15ClN4O6S
InChI: InChI=1S/C15H15ClN4O6S/c1-3-26-13(21)9-6-4-5-7-10(9)27(23,24)20-15(22)19-14-17-11(16)8-12(18-14)25-2/h4-8,19-20H,3H2,1-2H3
42 atoms
Cl -6.301348 -0.95294 0.724855
S  1.735549 -0.613951 -1.441129
O  2.952533 2.309594 0.790473
O  1.819018 0.809723 -1.709729
O  2.045148 -1.569549 -2.479778
O  0.971146 1.345871 1.192392
O  0.314312 -3.062316 -0.569533
O  -2.85193 2.375917 -0.692541
N  0.164413 -0.827585 -0.938977
N  -1.670924 -2.053991 -0.213441
N  -2.23207 0.192404 -0.458506
N  -3.814563 -1.428239 0.198644
C  2.73107 -0.97525 -0.022639
C  2.906909 -0.008652 0.966666
C  3.390045 -2.193146 0.035565
C  3.760276 -0.284889 2.024636
C  4.225025 -2.461052 1.109738
C  4.408715 -1.509782 2.099795
C  2.154436 1.284266 0.977026
C  -0.342633 -2.045624 -0.578118
C  2.36866 3.62743 0.773115
C  -2.601587 -1.045338 -0.159869
C  3.458579 4.604859 0.419915
C  -3.159223 1.133665 -0.400579
C  -4.477794 0.850824 -0.033028
C  -4.71801 -0.470261 0.254413
C  -1.505877 2.692842 -1.050996
H  3.266088 -2.928373 -0.74624
H  3.914012 0.452604 2.801562
H  -0.435307 0.000259 -0.847237
H  4.736075 -3.41235 1.163678
H  5.064473 -1.715432 2.935105
H  -2.021982 -2.968999 0.0395
H  1.940524 3.847087 1.752759
H  1.564469 3.657514 0.035043
H  3.040162 5.611174 0.401725
H  4.266173 4.593121 1.152184
H  3.877203 4.401105 -0.565895
H  -5.235803 1.617404 0.018143
H  -1.497325 3.763299 -1.236714
H  -1.201056 2.173033 -1.959813
H  -0.817819 2.463062 -0.238481
elementType: Cl S O N C H
totalener: -2109.58939412 hartree
nucrepener: 2964.38841607 hartree
electener: -5073.97781020 hartree
oneelecener: -8791.37415012 hartree
twoeener: 3717.39633992 hartree
cpcmener: -0.03728663 hartree
kineticenergy: 2103.04171666 hartree
xcener: -155.809796970740 hartree
chargesum: 0.0000000
charge: -0.051800 0.875989 -0.262887 -0.505012 -0.486509 -0.425228 -0.456517 -0.279296 -0.201850 -0.136656 -0.413101 -0.359233 -0.121370 0.078731 -0.016721 -0.192439 -0.164529 -0.111892 0.429364 0.375428 0.041910 0.405457 -0.251246 0.407218 -0.263438 0.192277 -0.125871 0.144096 0.147384 0.219933 0.166117 0.165087 0.191051 0.104302 0.092783 0.089504 0.091898 0.090043 0.149274 0.143234 0.119121 0.105392
qa: -0.0518 0.8760 -0.2629 -0.5050 -0.4865 -0.4252 -0.4565 -0.2793 -0.2018 -0.1367 -0.4131 -0.3592 -0.1214 0.0787 -0.0167 -0.1924 -0.1645 -0.1119 0.4294 0.3754 0.0419 0.4055 -0.2512 0.4072 -0.2634 0.1923 -0.1259 0.1441 0.1474 0.2199 0.1661 0.1651 0.1911 0.1043 0.0928 0.0895 0.0919 0.0900 0.1493 0.1432 0.1191 0.1054
va: 1.2538 5.8208 2.1466 1.9809 2.0181 2.0708 2.0635 2.1685 3.0940 3.1921 2.9981 3.0016 3.7807 3.7144 3.8579 4.0222 3.9467 3.8990 4.0924 4.4098 3.8463 4.1868 3.9747 4.0396 3.9577 4.2212 3.8365 1.0245 1.0062 1.0457 0.9877 0.9869 1.0191 0.9961 0.9928 1.0064 1.0027 1.0037 1.0118 0.9954 0.9942 1.0067
dispcorr: -0.024175317 hartree
energy: -2109.613569441671
dipole: 28.18252 -27.69445 0.48807 22.01162 -19.80403 2.20759 3.85597 -1.95908 1.89690
magnitude: 2.95125 au
magnitude: 7.50148 debye
