program: Gaussian 09
title: 000074122
version: EM64L-G09RevD.01
frameworkgroup: C1[X(C20H28N2)]
method: RPBEPBE
basis: SDD
operation: Freq
keyword: #pfreq=noraman
keyword: PBEPBE/SDD
title: #p freq=noraman PBEPBE/SDD
converged: YES YES NO NO
title: Mulliken charges:
elementType: N N C C C C C C C C C C C C C C C C C C C C H H H H H H H H H H H H H H H H H H H H H H H H H H H H
charge: -0.433074 -0.523007 -0.375935 -0.364736 -0.372309 -0.457775 -0.352979 -0.348405 -0.356544 -0.695864 0.470392 -0.419942 -0.373541 0.461605 -0.438879 -0.397559 0.455930 -0.450035 -0.390088 -0.197645 -0.216552 -0.274847 0.191622 0.191754 0.193894 0.195719 0.190498 0.189947 0.206519 0.209846 0.188185 0.187928 0.208950 0.209280 0.195194 0.195433 0.292418 0.216103 0.209823 0.209811 0.213069 0.238430 0.227787 0.260697 0.288646 0.217163 0.262086 0.219107 0.218244 0.223635
chargesum: 0.00000
title: Mulliken charges with hydrogens summed into heavy atoms:
elementType: N N C C C C C C C C C C C C C C C C C C C C
charge: -0.140656 -0.234361 0.007441 0.024877 0.008136 -0.041410 0.023135 0.069825 0.034083 -0.060127 0.470392 -0.206872 -0.135111 0.461605 -0.211092 -0.136862 0.455930 -0.232872 -0.128003 0.021463 0.001692 -0.051212
polarizability: 3.95680654e+02 3.67211531e+01 2.25608466e+02 1.39659647e+01 -4.16744904e+00 1.43386597e+02
1716.lowfreq: -0.0012 -0.0003 0.0017 2.8211 5.5064 8.0143 16.3964 23.4095 35.3094
frequency: 16.2927 23.2937 35.1371 39.5413 47.2554 49.8748 65.7420 76.5577 94.0585 101.8639 115.9316 142.4137 148.5689 151.5081 169.6926 177.0627 211.2714 224.0488 265.6151 275.7018 282.7017 316.4026 357.2700 370.7052 408.2184 412.8966 416.7266 451.2548 473.3939 501.8654 504.4350 510.4927 571.2742 609.7778 619.3140 643.1767 692.0112 708.1659 722.5741 728.9850 750.0429 750.7445 785.2130 794.1096 803.6086 815.8907 826.6401 828.9276 865.3761 867.1922 881.8032 888.4743 922.2198 940.5575 945.6139 960.5023 977.9033 979.9961 993.2570 994.2268 1012.7659 1015.7160 1024.2950 1047.9442 1070.2443 1080.6817 1082.8077 1085.8527 1104.8878 1119.3855 1140.2615 1157.0778 1168.2817 1185.6803 1189.5872 1190.3556 1219.0397 1226.4733 1228.4859 1257.2954 1262.3779 1268.6168 1281.8547 1284.2655 1285.4096 1296.4378 1297.5117 1310.5684 1315.0312 1329.2354 1339.9244 1355.5893 1357.9936 1367.8710 1371.9374 1384.2626 1388.5943 1424.8529 1434.4434 1462.0480 1462.2900 1466.2277 1468.8294 1470.7382 1475.9071 1477.0511 1483.6139 1487.0304 1488.6878 1500.3038 1513.8195 1525.4738 1583.5710 1593.0555 1619.3223 1644.4199 2915.7437 2951.0410 2951.5372 2952.1851 2956.4647 2959.0124 2966.6358 2969.9177 2972.1050 2985.7471 2993.3935 3003.9383 3017.2025 3032.1645 3044.0157 3068.6324 3071.1707 3107.2298 3107.6842 3124.3963 3132.8968 3136.3962 3141.7113 3157.4068 3163.7007 3169.6078 3542.2003 3572.4505
redmass: 3.8281 4.5832 3.5586 2.0040 2.9648 3.9626 2.6289 2.0226 3.6100 3.1606 1.9116 2.7140 3.7167 2.1237 4.2238 4.2009 3.8899 1.1404 1.1160 4.0092 4.0894 4.4023 3.1478 3.8964 2.9416 3.0415 3.0231 1.4926 3.2723 2.7793 3.4525 2.4908 5.4246 5.5381 5.9973 6.7063 1.9703 3.6703 1.0612 1.0803 1.7597 1.1155 2.6992 1.2296 1.3754 2.0164 1.3603 3.8175 1.2705 4.1140 1.4718 1.8922 1.3594 1.3046 1.2170 1.3502 1.3367 4.9639 4.2062 2.8530 2.2997 1.3963 2.1389 3.2820 2.6996 2.5205 2.0617 1.5664 2.4370 1.8404 2.2849 1.5478 1.0500 1.1078 1.1429 1.6018 1.3124 2.6129 1.3852 1.3209 1.2376 1.5024 1.1153 1.3228 1.1689 1.0922 1.1180 1.4636 1.6432 1.4455 1.4893 1.5925 1.6632 1.9906 2.9597 4.3934 1.2177 3.6718 2.2578 1.0759 1.0732 1.1326 1.5227 1.1649 1.0452 1.0809 1.0916 2.1549 1.0976 1.1228 2.1380 3.0612 5.5991 4.0590 6.2434 6.6481 1.0570 1.1019 1.0591 1.0594 1.0590 1.0591 1.0587 1.0583 1.0367 1.0969 1.0990 1.1019 1.1042 1.1050 1.1048 1.1007 1.0993 1.0866 1.0872 1.0862 1.0965 1.0930 1.0872 1.0948 1.0969 1.0982 1.0753 1.0770
irintensity: 0.0656 0.0838 0.5809 1.3672 0.3894 0.8395 1.7011 3.4801 0.3991 0.1067 6.9647 0.8947 0.0480 2.5922 0.2617 1.6188 4.7713 0.0345 76.7576 3.7668 0.3353 0.7671 26.3045 5.0299 2.1863 3.4248 3.5239 143.4601 1.6353 8.0851 5.1439 11.1432 7.0072 1.6292 6.0561 0.4108 43.6292 2.0458 15.2285 0.0980 80.5407 3.6317 28.4634 1.3961 0.9387 58.2448 6.7757 16.9134 0.2160 3.4426 5.4309 4.2419 0.3728 0.3975 0.8116 0.2897 0.6321 8.4189 0.0635 0.2320 2.0488 0.7922 11.1618 2.4565 1.8930 0.5449 0.3873 9.9964 0.9657 9.4598 25.4146 0.6241 1.0454 1.0073 19.2421 1.0131 9.2559 8.9822 1.1980 10.5262 0.9762 23.6226 5.1332 22.9325 7.1578 0.1546 0.8281 30.4718 164.8679 16.0090 3.1053 0.3541 1.0315 4.6706 26.7522 65.7417 11.8724 3.8732 46.1217 0.0793 0.6316 8.8979 13.9328 1.1288 12.2944 9.2018 3.2223 125.4067 28.3331 144.5480 122.6171 726.6104 1.6137 17.3585 242.5526 63.9980 62.5535 29.8081 0.2362 0.6307 5.4571 1.2199 12.6817 207.8192 37.4684 0.0988 0.5006 1.8116 5.0348 1.2777 192.5064 98.1331 54.8262 33.6780 9.7904 3.3169 25.7795 32.9510 35.4823 31.2454 9.6847 10.6602 17.2006 46.8359
temp: 298.150 k
press: 1.00000 atm
elementType: 7 7 6 6 6 6 6 6 6 6 6 6 6 6 6 6 6 6 6 6 6 6 1 1 1 1 1 1 1 1 1 1 1 1 1 1 1 1 1 1 1 1 1 1 1 1 1 1 1 1
symmnumber: 1
zpe: 1137398.9 jmol-1
zpe.correction: 0.433212 hartree
zpe.thermalcorrener: 0.456736 hartree
zpe.thermalcorrenthalpy: 0.457680 hartree
zpe.thermalcorrgfe: 0.376587 hartree
zpe.sumelectzpe: -886.780330 hartree
zpe.sumelectthermal: -886.756806 hartree
zpe.sumelectthermalent: -886.755862 hartree
zpe.sumelectthermalfe: -886.836955 hartree
dipole: 3.4405 1.5132 -0.0985
dipole: 3.7598
quadrupole: -134.3642 -124.5184 -138.8913
quadrupole: -5.6514 4.8692 -1.0783
quadrupole: -1.7729 8.0729 -6.3000 -5.6514 4.8692 -1.0783
hfenergy: -887.2135423 hartree
pointgroup: C01 [X(C20H28N2)]
dipole: -1.3575642 0.5864278 0.0351148 debye
polarizability: 396.073916|-35.6189962|225.130792|14.6450996|4.1868336|143.4710081 unknown
InChI: InChI=1S/C20H28N2/c1-2-3-4-5-6-10-17-21-18-13-15-20(16-14-18)22-19-11-8-7-9-12-19/h7-9,11-16,21-22H,2-6,10,17H2,1H3
charge 0 multiplicity 1
50 atoms
N  -1.057467 1.413161 -0.268726
N  4.590683 0.984246 0.342628
C  -5.96751 0.237226 -0.123635
C  -4.514737 -0.264924 0.034384
C  -7.023106 -0.867962 0.105189
C  -3.46416 0.840948 -0.207214
C  -8.47704 -0.362622 -0.032853
C  -2.019796 0.341854 -0.00606
C  -9.533073 -1.468984 0.192157
C  -10.983059 -0.954782 0.060257
C  0.325644 1.276545 -0.126997
C  1.189689 2.381478 -0.390523
C  0.925198 0.050214 0.286008
C  3.179205 1.035045 0.155767
C  2.583742 2.256429 -0.26526
C  2.322226 -0.060669 0.436748
C  5.464775 -0.104288 0.163569
C  6.780352 -0.017092 0.710002
C  5.111114 -1.272506 -0.573152
C  7.7070 -1.061807 0.526607
C  6.0473 -2.314069 -0.741433
C  7.349282 -2.226078 -0.194915
H  -6.147362 1.068005 0.590424
H  -6.100507 0.665433 -1.139224
H  -4.382049 -0.682363 1.054082
H  -4.337598 -1.102147 -0.671992
H  -6.852287 -1.693664 -0.617023
H  -6.882602 -1.30552 1.115886
H  -3.575665 1.233859 -1.239245
H  -3.655633 1.688045 0.483448
H  -8.619524 0.078345 -1.041812
H  -8.65042 0.459847 0.692548
H  -1.832187 -0.524713 -0.678971
H  -1.905295 -0.032376 1.035253
H  -9.386615 -1.912048 1.198509
H  -9.362601 -2.288568 -0.535632
H  -1.422562 2.312956 -0.577827
H  -11.717317 -1.764562 0.226043
H  -11.164756 -0.534965 -0.947255
H  -11.188853 -0.155899 0.797637
H  0.760067 3.339939 -0.709323
H  0.299768 -0.81947 0.509826
H  3.225013 3.114951 -0.501301
H  2.7455 -1.001535 0.801918
H  5.027262 1.854399 0.650248
H  7.066693 0.87416 1.283885
H  4.123148 -1.348006 -1.035926
H  8.711559 -0.969365 0.955847
H  5.756368 -3.200593 -1.317489
H  8.068093 -3.040806 -0.330381
