program: Orca
programVersion: 4.2.1
elementType: Cl S O O O O O O N N N N C C C C C C C C C C C C C C C H H H H H H H H H H H H H H H
charge: 0
multiplicity: 1
keywords: wb97x-d3
keywords: def2-TZVPP
keywords: def2/J RIJCOSX GRIDX6 NOFINALGRIDX
keywords: grid4 nofinalgrid
keywords: scfconv7
keywords: smallprint printgap noloewdin
keywords: NOSOSCF
formula: C15H15ClN4O6S
InChI: InChI=1S/C15H15ClN4O6S/c1-3-26-13(21)9-6-4-5-7-10(9)27(23,24)20-15(22)19-14-17-11(16)8-12(18-14)25-2/h4-8,19-20H,3H2,1-2H3
42 atoms
Cl -6.189614 -1.266632 -1.108526
S  1.591358 -0.363844 1.793433
O  2.955639 2.115511 -1.220661
O  1.866819 -1.157248 2.96288
O  1.631592 1.082626 1.847564
O  0.945624 1.145405 -1.008078
O  0.290858 -2.968058 1.106192
O  -3.029214 2.336463 0.314232
N  0.053972 -0.706481 1.241441
N  -1.675855 -2.064967 0.478666
N  -2.324614 0.168969 0.404674
N  -3.77014 -1.581306 -0.248194
C  2.668961 -0.919848 0.48918
C  2.916867 -0.133821 -0.636411
C  3.339356 -2.116062 0.686566
C  3.865196 -0.568048 -1.553237
C  4.261166 -2.548144 -0.254023
C  4.5264 -1.77282 -1.369106
C  2.144684 1.107382 -0.947475
C  -0.375445 -1.975729 0.963798
C  2.370888 3.389344 -1.519656
C  -2.619729 -1.109502 0.2052
C  2.07294 4.166056 -0.25557
C  -3.264416 1.056244 0.130088
C  -4.519857 0.679138 -0.352661
C  -4.689111 -0.677499 -0.515891
C  -1.744834 2.738207 0.782041
H  3.144098 -2.704469 1.57072
H  4.081693 0.03355 -2.425486
H  -0.534815 0.080508 0.960632
H  4.77637 -3.486986 -0.10515
H  5.253405 -2.100493 -2.099903
H  -1.971814 -3.011271 0.288311
H  1.474424 3.261352 -2.127926
H  3.119014 3.902772 -2.12224
H  2.974261 4.317461 0.336713
H  1.673254 5.146258 -0.51738
H  1.341663 3.656293 0.369408
H  -5.288432 1.401265 -0.577908
H  -1.794337 3.819721 0.872037
H  -0.95947 2.464497 0.077792
H  -1.516799 2.307698 1.75799
totalener: -2109.56120636 hartree
nucrepener: 2979.08206591 hartree
electener: -5088.64327227 hartree
oneelecener: -8820.06694823 hartree
twoeener: 3731.42367596 hartree
kineticenergy: 2103.07433376 hartree
xcener: -155.809440704064 hartree
chargesum: 0.0000000
charge: -0.038366 0.869457 -0.260021 -0.430760 -0.474376 -0.389180 -0.377022 -0.260671 -0.207700 -0.162124 -0.408966 -0.324061 -0.205985 0.100267 0.038608 -0.193771 -0.142783 -0.092055 0.423526 0.346269 0.012344 0.390886 -0.234110 0.384621 -0.273455 0.184252 -0.133785 0.138854 0.122025 0.212193 0.135937 0.133569 0.172300 0.091796 0.102493 0.095369 0.084441 0.081162 0.133284 0.130766 0.108194 0.116580
qa: -0.0384 0.8695 -0.2600 -0.4308 -0.4744 -0.3892 -0.3770 -0.2607 -0.2077 -0.1621 -0.4090 -0.3241 -0.2060 0.1003 0.0386 -0.1938 -0.1428 -0.0921 0.4235 0.3463 0.0123 0.3909 -0.2341 0.3846 -0.2735 0.1843 -0.1338 0.1389 0.1220 0.2122 0.1359 0.1336 0.1723 0.0918 0.1025 0.0954 0.0844 0.0812 0.1333 0.1308 0.1082 0.1166
va: 1.2667 5.8347 2.1479 2.0828 2.0153 2.1007 2.1414 2.1766 3.1089 3.1747 2.9921 3.0128 3.9504 3.6713 3.8623 4.0676 3.9777 3.9390 4.1085 4.4074 3.8695 4.1783 3.9286 4.0518 3.9781 4.2327 3.8596 1.0285 1.0206 1.0436 0.9988 0.9982 1.0340 1.0097 0.9962 1.0082 1.0083 1.0142 1.0197 0.9947 1.0068 0.9952
dispcorr: -0.024868891 hartree
energy: -2109.586075248450
dipole: 24.76808 -24.28241 0.48568 20.84621 -19.52277 1.32344 -3.70209 2.08428 -1.61781
magnitude: 2.14585 au
magnitude: 5.45432 debye
