program: Orca
programVersion: 4.2.1
elementType: Cl S O O O O O O N N N N C C C C C C C C C C C C C C C H H H H H H H H H H H H H H H
charge: 0
multiplicity: 1
keywords: wb97x-d3
keywords: def2-TZVPP
keywords: def2/J RIJCOSX GRIDX6 NOFINALGRIDX
keywords: grid4 nofinalgrid
keywords: scfconv7
keywords: smallprint printgap noloewdin
keywords: NOSOSCF
formula: C15H15ClN4O6S
InChI: InChI=1S/C15H15ClN4O6S/c1-3-26-13(21)9-6-4-5-7-10(9)27(23,24)20-15(22)19-14-17-11(16)8-12(18-14)25-2/h4-8,19-20H,3H2,1-2H3
42 atoms
Cl -6.129135 -1.206176 -1.248226
S  1.599876 -0.376479 1.806067
O  2.952656 2.113236 -1.220492
O  1.877037 -1.181211 2.967323
O  1.645031 1.069256 1.872716
O  0.943508 1.149605 -0.978527
O  0.293913 -2.968201 1.083701
O  -3.005493 2.356169 0.348339
N  0.059208 -0.708897 1.255909
N  -1.662586 -2.050022 0.446117
N  -2.307246 0.185884 0.4075
N  -3.735512 -1.545677 -0.326808
C  2.671093 -0.926171 0.493089
C  2.916133 -0.134609 -0.629376
C  3.34044 -2.124385 0.681438
C  3.860871 -0.56546 -1.551737
C  4.2577 -2.553271 -0.264895
C  4.520654 -1.772291 -1.376524
C  2.143067 1.107639 -0.933784
C  -0.368617 -1.972042 0.950386
C  2.365867 3.385787 -1.520126
C  -2.597505 -1.086913 0.169226
C  2.070264 4.166007 -0.257304
C  -3.237431 1.081245 0.127238
C  -4.479215 0.718185 -0.399323
C  -4.645168 -0.633888 -0.59864
C  -1.731975 2.74342 0.856835
H  3.147155 -2.717417 1.562851
H  4.075024 0.040417 -2.42157
H  -0.528252 0.083173 0.98667
H  4.771599 -3.493915 -0.12313
H  5.244549 -2.097285 -2.111571
H  -1.956299 -2.991352 0.229576
H  1.467753 3.255442 -2.126142
H  3.112128 3.898855 -2.125969
H  1.66929 5.144936 -0.521066
H  1.340785 3.657617 0.371079
H  2.973234 4.319831 0.332275
H  -5.240169 1.446735 -0.629476
H  -1.530803 2.293001 1.829466
H  -1.779805 3.82308 0.966692
H  -0.930048 2.480092 0.167367
totalener: -2109.56113642 hartree
nucrepener: 2981.27146673 hartree
electener: -5090.83260316 hartree
oneelecener: -8824.45057764 hartree
twoeener: 3733.61797448 hartree
kineticenergy: 2103.07491422 hartree
xcener: -155.809521343440 hartree
chargesum: -0.0000000
charge: -0.038799 0.869627 -0.260648 -0.431000 -0.474146 -0.389380 -0.377007 -0.260669 -0.207088 -0.162209 -0.407766 -0.324220 -0.207781 0.099774 0.039682 -0.194324 -0.142595 -0.091870 0.425086 0.345525 0.013288 0.390635 -0.234227 0.385109 -0.273479 0.184168 -0.131878 0.138881 0.122237 0.211435 0.135973 0.133630 0.172173 0.091659 0.102460 0.084468 0.080828 0.095394 0.133263 0.116839 0.130977 0.105979
qa: -0.0388 0.8696 -0.2606 -0.4310 -0.4741 -0.3894 -0.3770 -0.2607 -0.2071 -0.1622 -0.4078 -0.3242 -0.2078 0.0998 0.0397 -0.1943 -0.1426 -0.0919 0.4251 0.3455 0.0133 0.3906 -0.2342 0.3851 -0.2735 0.1842 -0.1319 0.1389 0.1222 0.2114 0.1360 0.1336 0.1722 0.0917 0.1025 0.0845 0.0808 0.0954 0.1333 0.1168 0.1310 0.1060
va: 1.2662 5.8347 2.1478 2.0822 2.0157 2.0999 2.1415 2.1765 3.1084 3.1750 2.9917 3.0130 3.9527 3.6697 3.8609 4.0683 3.9779 3.9391 4.1057 4.4083 3.8694 4.1785 3.9288 4.0510 3.9785 4.2325 3.8602 1.0286 1.0209 1.0451 0.9988 0.9982 1.0340 1.0097 0.9960 1.0084 1.0142 1.0081 1.0196 0.9952 0.9948 1.0070
dispcorr: -0.024891242 hartree
energy: -2109.586027666574
dipole: 24.56849 -24.08535 0.48315 20.69757 -19.36300 1.33457 -3.21153 1.60332 -1.60820
magnitude: 2.14495 au
magnitude: 5.45204 debye
