program: Gaussian 09
title: 000074054
version: EM64L-G09RevD.01
frameworkgroup: C1[X(C8H5ClN2)]
method: RPBEPBE
basis: SDD
operation: Freq
keyword: #p
keyword: freq=noraman
keyword: PBEPBE/SDD
title: #p freq=noraman PBEPBE/SDD
converged: NO NO NO NO
title: Mulliken charges:
elementType: Cl N N C C C C C C C C H H H H H
charge: 0.007404 0.059616 0.076952 0.341908 0.089762 -0.345785 -0.313990 -0.366053 -0.234726 -0.198735 -0.367458 0.241502 0.270123 0.260147 0.238612 0.240722
chargesum: 0.00000
title: Mulliken charges with hydrogens summed into heavy atoms:
elementType: Cl N N C C C C C C C C
charge: 0.007404 0.059616 0.076952 0.341908 0.089762 -0.104283 -0.043867 -0.105906 0.003886 0.041987 -0.367458
polarizability: 1.78609710e+02 -3.08619031e+00 1.05739563e+02 1.61666866e-02 6.17682461e-03 4.04590343e+01
1716.lowfreq: -0.0028 -0.0023 -0.0017 7.7859 14.4743 22.6422 85.8114 170.1502 218.5900
frequency: 85.6740 170.1499 218.5872 269.0660 353.3900 401.2560 426.1017 464.6609 503.9686 526.0703 582.4813 641.6439 690.6015 755.1114 771.1028 798.8546 838.8390 882.9075 899.9805 938.1328 977.5382 1004.8396 1012.9342 1088.5336 1136.8007 1169.6398 1230.1777 1245.4432 1271.5080 1316.3996 1369.4650 1399.7365 1428.9797 1476.4003 1521.3400 1555.9838 1622.3839 3124.4699 3129.4381 3141.9898 3162.6681 3178.1860
redmass: 7.2220 5.6626 8.5470 5.6664 13.1968 3.7275 5.8816 2.9355 8.6311 3.5594 8.4882 7.7807 5.8987 6.0969 1.2895 3.5722 7.9268 1.4878 5.7955 1.5222 1.3992 1.3383 2.1967 4.1770 1.8474 1.1563 3.1155 2.1338 1.9074 4.1501 1.8297 4.9581 3.0734 3.3095 5.6906 6.3588 6.4693 1.0927 1.0876 1.0901 1.0962 1.0985
irintensity: 0.6046 0.3465 0.4169 0.8402 7.5443 0.1451 6.3343 6.5487 0.6598 3.3618 16.3458 11.4301 5.1968 2.8069 79.3700 5.7649 23.0726 4.5320 2.3358 11.0456 6.9691 0.1295 2.7941 153.1095 91.7297 9.6391 1.5437 7.8718 3.7523 35.7394 90.2188 47.1515 29.0194 34.9417 144.6233 20.4654 27.6096 9.3346 3.1959 10.4781 19.0354 10.2265
temp: 298.150 k
press: 1.00000 atm
elementType: 17 7 7 6 6 6 6 6 6 6 6 1 1 1 1 1
symmnumber: 1
zpe: 291789.7 jmol-1
zpe.correction: 0.111137 hartree
zpe.thermalcorrener: 0.119140 hartree
zpe.thermalcorrenthalpy: 0.120085 hartree
zpe.thermalcorrgfe: 0.077577 hartree
zpe.sumelectzpe: -876.656415 hartree
zpe.sumelectthermal: -876.648412 hartree
zpe.sumelectthermalent: -876.647467 hartree
zpe.sumelectthermalfe: -876.689975 hartree
dipole: 5.6369 0.9242 0.0001
dipole: 5.7121
quadrupole: -66.7671 -65.1709 -72.2069
quadrupole: 0.9225 0.0001 0.0007
quadrupole: 1.2812 2.8774 -4.1586 0.9225 0.0001 0.0007
hfenergy: -876.7675521 hartree
pointgroup: C01 [X(C8H5Cl1N2)]
dipole: -2.1817219 -0.5390597 0.0000458 debye
dipolederiv: -0.9748203 -0.2041467 0.0004458 -0.3337284 -0.1705735 0.0001595 0.0014263 0.000276 -0.0680136 -1.0520145 -0.1174592 0.0004749 0.3180843 -0.3897436 -0.0003343 0.0004451 0.0001494 -0.1641899 -0.8602392 -0.1041577 0.0001329 -0.5335931 -0.5744889 0.0003479 0.0004875 -0.0001343 -0.1627089 -0.2901885 0.0725742 0.0000351 0.2850676 -0.3847533 0.0000136 -0.0001307 -0.0000176 0.1251514 0.5826011 0.1076573 0.0000019 -0.3055137 0.1371504 0.0000148 -0.0000196 -0.0000401 0.0709641 0.0501277 -0.0578919 -0.000023 0.0958013 0.147136 0.000001 0.0000346 0.0000508 -0.1443047 -0.3069106 -0.0214067 0.0000283 0.0564454 0.1245926 0.0000079 -0.0001012 -0.0000569 -0.1607084 0.6509763 -0.087063 -0.0000365 -0.0740247 0.4618668 0.0000525 -0.0000174 -0.0000723 -0.0253041 0.0548627 0.1439342 0.0000222 0.1273119 -0.1187974 -0.0000099 0.0000302 -0.000004 -0.1519696 0.0972324 -0.0824312 0.0000191 -0.1109077 0.1507408 -0.0000291 0.0000708 -0.0000094 -0.1226701 1.9495063 0.4197768 -0.0010953 0.533108 0.7027309 -0.000216 -0.0020681 -0.0001508 0.0432861 0.0699952 0.0056374 -0.0000053 -0.0654053 -0.0826508 0.0000011 0.0000185 -0.0000155 0.1625779 0.0927964 -0.0459187 -0.0000066 0.0036438 -0.0249319 0.0000039 -0.0000152 -0.0000047 0.1650995 0.0597224 -0.0635412 0.0000342 -0.0336929 -0.0658795 -0.0000251 -0.0001088 0.000003 0.1106797 -0.092501 -0.062805 -0.0000138 -0.0595025 0.0721403 0.0000008 -0.0000381 -0.0000127 0.1632292 -0.0311466 0.0972416 -0.000014 0.096906 0.015461 0.0000114 -0.0000138 0.0000391 0.1588815 unknown
polarizability: 178.6375327|2.7379416|105.7117398|-0.0156234|-0.0074447|40.4590343 unknown
InChI: InChI=1S/C8H5ClN2/c9-8-10-5-6-3-1-2-4-7(6)11-8/h1-5H
charge 0 multiplicity 1
16 atoms
Cl 3.747204 0.809846 -0.001288
N  1.075486 1.109967 0.000348
N  1.930056 -1.177388 0.000224
C  -0.487932 -0.80397 0.000144
C  -0.228905 0.622178 0.000133
C  -1.835885 -1.280919 0.000082
C  -1.32715 1.536367 0.000013
C  0.668166 -1.653747 0.000124
C  -2.893556 -0.368419 -0.000019
C  -2.634682 1.04199 -0.000062
C  2.041866 0.195059 0.000879
H  -2.023859 -2.361202 0.000074
H  -1.107501 2.607849 0.000002
H  0.560355 -2.745661 0.000008
H  -3.929257 -0.724254 -0.000096
H  -3.479508 1.739603 -0.000165
