program: Orca
programVersion: 4.2.1
elementType: Cl S O O O O O O N N N N C C C C C C C C C C C C C C C H H H H H H H H H H H H H H H
charge: 0
multiplicity: 1
keywords: wb97x-d3
keywords: def2-TZVPP
keywords: def2/J RIJCOSX GRIDX6 NOFINALGRIDX
keywords: grid4 nofinalgrid
keywords: scfconv7
keywords: smallprint printgap noloewdin
keywords: NOSOSCF
formula: C15H15ClN4O6S
InChI: InChI=1S/C15H15ClN4O6S/c1-3-26-13(21)9-6-4-5-7-10(9)27(23,24)20-15(22)19-14-17-11(16)8-12(18-14)25-2/h4-8,19-20H,3H2,1-2H3
42 atoms
Cl -3.199535 1.417937 1.906184
S  1.307315 -1.92958 0.815597
O  1.374085 1.182215 1.148108
O  1.306405 -3.336913 0.508732
O  1.105447 -1.463744 2.168024
O  3.220096 1.59284 2.345329
O  0.751706 -1.937194 -2.113357
O  -4.864367 1.756067 -2.792805
N  0.085676 -1.188862 -0.069639
N  -1.082349 -0.64203 -2.018004
N  -2.967897 0.556998 -2.402191
N  -2.123426 0.369744 -0.202093
C  2.817064 -1.233223 0.171981
C  3.322493 -0.003057 0.600143
C  3.548455 -2.043676 -0.683814
C  4.586438 0.376288 0.162568
C  4.790452 -1.629001 -1.135735
C  5.311863 -0.42146 -0.706733
C  2.636352 0.985354 1.49153
C  -0.012655 -1.312421 -1.424196
C  0.611989 2.124869 1.915927
C  -2.090381 0.122142 -1.502471
C  0.184819 1.590441 3.265617
C  -3.963487 1.290261 -1.954448
C  -4.117637 1.608044 -0.596831
C  -3.140678 1.102137 0.220245
C  -4.726863 1.450545 -4.174604
H  3.150794 -2.998869 -0.991469
H  5.000677 1.313032 0.509104
H  -0.555694 -0.571262 0.428611
H  5.350982 -2.260791 -1.81086
H  6.288494 -0.098404 -1.041215
H  -1.122148 -0.771337 -3.018113
H  -0.257946 2.330977 1.293828
H  1.178729 3.051549 2.025122
H  -0.373565 0.661146 3.172019
H  1.035237 1.417815 3.922029
H  -0.46339 2.327097 3.742378
H  -4.940283 2.203969 -0.234912
H  -3.795041 1.843954 -4.581094
H  -5.569732 1.929287 -4.664589
H  -4.760824 0.375834 -4.353269
totalener: -2109.55788915 hartree
nucrepener: 2999.01852372 hartree
electener: -5108.57641287 hartree
oneelecener: -8859.88117461 hartree
twoeener: 3751.30476175 hartree
kineticenergy: 2103.07676494 hartree
xcener: -155.807767251867 hartree
chargesum: -0.0000000
charge: -0.035052 0.870809 -0.275075 -0.433665 -0.459546 -0.353830 -0.379794 -0.256705 -0.198082 -0.164090 -0.395420 -0.376700 -0.233815 0.082948 0.046719 -0.178927 -0.141779 -0.092625 0.418895 0.350633 -0.007692 0.400204 -0.258790 0.360308 -0.240938 0.194636 -0.124316 0.134623 0.130709 0.196801 0.134021 0.133999 0.170066 0.091449 0.104672 0.085785 0.118404 0.092799 0.136675 0.110995 0.127531 0.113158
qa: -0.0351 0.8708 -0.2751 -0.4337 -0.4595 -0.3538 -0.3798 -0.2567 -0.1981 -0.1641 -0.3954 -0.3767 -0.2338 0.0829 0.0467 -0.1789 -0.1418 -0.0926 0.4189 0.3506 -0.0077 0.4002 -0.2588 0.3603 -0.2409 0.1946 -0.1243 0.1346 0.1307 0.1968 0.1340 0.1340 0.1701 0.0914 0.1047 0.0858 0.1184 0.0928 0.1367 0.1110 0.1275 0.1132
va: 1.2746 5.8203 2.1025 2.0803 2.0328 2.1434 2.1382 2.1673 3.1049 3.1704 2.9920 2.9789 3.9584 3.6754 3.8543 4.0519 3.9740 3.9317 4.1402 4.4029 3.8583 4.1750 3.8788 4.0957 3.9869 4.1446 3.8670 1.0307 1.0207 1.0621 0.9991 0.9983 1.0348 1.0023 1.0135 1.0138 1.0191 1.0054 1.0155 0.9965 0.9937 0.9960
dispcorr: -0.025230997 hartree
energy: -2109.583120149246
dipole: 4.20970 -5.71599 -1.50630 8.22248 -6.47146 1.75103 -7.54654 5.40314 -2.14339
magnitude: 3.15106 au
magnitude: 8.00935 debye
