program: Orca
programVersion: 4.2.1
elementType: Cl S O O O O O O N N N N C C C C C C C C C C C C C C C H H H H H H H H H H H H H H H
charge: 0
multiplicity: 1
keywords: wb97x-d3
keywords: def2-TZVPP
keywords: def2/J RIJCOSX GRIDX6 NOFINALGRIDX
keywords: grid4 nofinalgrid
keywords: scfconv7
keywords: smallprint printgap noloewdin
keywords: NOSOSCF
formula: C15H15ClN4O6S
InChI: InChI=1S/C15H15ClN4O6S/c1-3-26-13(21)9-6-4-5-7-10(9)27(23,24)20-15(22)19-14-17-11(16)8-12(18-14)25-2/h4-8,19-20H,3H2,1-2H3
42 atoms
Cl -6.14816 -1.143417 -1.290554
S  1.586487 -0.411167 1.779014
O  3.025771 2.153204 -1.13187
O  1.833962 -1.246219 2.925423
O  1.637981 1.032228 1.882507
O  1.005011 1.194588 -0.981197
O  0.277002 -2.977741 0.978111
O  -2.987201 2.379263 0.319858
N  0.05624 -0.720388 1.188237
N  -1.670442 -2.036057 0.347282
N  -2.30128 0.204205 0.34428
N  -3.747328 -1.508999 -0.398812
C  2.682832 -0.933569 0.476086
C  2.959242 -0.11257 -0.617449
C  3.338726 -2.142067 0.645556
C  3.921686 -0.524415 -1.529992
C  4.274555 -2.550974 -0.29147
C  4.568562 -1.740842 -1.374153
C  2.202455 1.144168 -0.90257
C  -0.378425 -1.975168 0.858638
C  2.455939 3.440024 -1.402197
C  -2.601967 -1.063605 0.092539
C  2.137389 4.179485 -0.12096
C  -3.229036 1.10859 0.085182
C  -4.478233 0.759791 -0.433506
C  -4.654288 -0.588503 -0.64959
C  -1.706612 2.753334 0.819755
H  3.121284 -2.758122 1.505335
H  4.16042 0.104308 -2.376903
H  -0.522407 0.081298 0.928726
H  4.77817 -3.499343 -0.165025
H  5.306986 -2.050479 -2.101346
H  -1.970588 -2.972252 0.117691
H  1.571265 3.337884 -2.032428
H  3.219766 3.96659 -1.973092
H  3.02721 4.30479 0.494376
H  1.751168 5.17065 -0.360323
H  1.389016 3.656965 0.472423
H  -5.237048 1.495898 -0.64619
H  -1.498253 2.29114 1.785554
H  -1.746883 3.832068 0.942116
H  -0.912616 2.493182 0.119881
totalener: -2109.56115443 hartree
nucrepener: 2978.91201570 hartree
electener: -5088.47317013 hartree
oneelecener: -8819.72887298 hartree
twoeener: 3731.25570285 hartree
kineticenergy: 2103.07573185 hartree
xcener: -155.809645115228 hartree
chargesum: 0.0000000
charge: -0.038488 0.869687 -0.260362 -0.430646 -0.474459 -0.388789 -0.377189 -0.260608 -0.207757 -0.162007 -0.408853 -0.324163 -0.206283 0.099518 0.039120 -0.193757 -0.143022 -0.092195 0.423852 0.346282 0.012774 0.390954 -0.234257 0.384290 -0.273106 0.184063 -0.133321 0.139135 0.122113 0.212117 0.135921 0.133730 0.172298 0.091861 0.102118 0.095478 0.084459 0.081071 0.133327 0.116543 0.130858 0.107692
qa: -0.0385 0.8697 -0.2604 -0.4306 -0.4745 -0.3888 -0.3772 -0.2606 -0.2078 -0.1620 -0.4089 -0.3242 -0.2063 0.0995 0.0391 -0.1938 -0.1430 -0.0922 0.4239 0.3463 0.0128 0.3910 -0.2343 0.3843 -0.2731 0.1841 -0.1333 0.1391 0.1221 0.2121 0.1359 0.1337 0.1723 0.0919 0.1021 0.0955 0.0845 0.0811 0.1333 0.1165 0.1309 0.1077
va: 1.2666 5.8345 2.1477 2.0828 2.0151 2.1012 2.1413 2.1765 3.1092 3.1748 2.9921 3.0127 3.9500 3.6708 3.8622 4.0675 3.9775 3.9389 4.1081 4.4077 3.8699 4.1781 3.9285 4.0521 3.9782 4.2328 3.8599 1.0284 1.0207 1.0437 0.9988 0.9981 1.0340 1.0096 0.9963 1.0082 1.0083 1.0141 1.0196 0.9951 0.9947 1.0067
dispcorr: -0.024858269 hartree
energy: -2109.586012700765
dipole: 24.98906 -24.46369 0.52536 20.72066 -19.34883 1.37183 -2.58619 1.02351 -1.56268
magnitude: 2.14474 au
magnitude: 5.45149 debye
