program: Orca
programVersion: 4.2.1
elementType: Cl S O O O O O O N N N N C C C C C C C C C C C C C C C H H H H H H H H H H H H H H H
charge: 0
multiplicity: 1
keywords: wb97x-d3
keywords: def2-TZVPP
keywords: def2/J RIJCOSX GRIDX6 NOFINALGRIDX
keywords: grid4 nofinalgrid
keywords: scfconv7
keywords: smallprint printgap noloewdin
keywords: NOSOSCF
formula: C15H15ClN4O6S
InChI: InChI=1S/C15H15ClN4O6S/c1-3-26-13(21)9-6-4-5-7-10(9)27(23,24)20-15(22)19-14-17-11(16)8-12(18-14)25-2/h4-8,19-20H,3H2,1-2H3
42 atoms
Cl -6.141735 -1.127958 -1.317082
S  1.585014 -0.417657 1.776914
O  3.038313 2.158519 -1.117099
O  1.827408 -1.25838 2.920213
O  1.637518 1.025186 1.887367
O  1.015958 1.201224 -0.977784
O  0.275589 -2.978928 0.959454
O  -2.980844 2.384665 0.31483
N  0.056606 -0.722323 1.179019
N  -1.669051 -2.03231 0.327502
N  -2.297147 0.208804 0.33206
N  -3.743376 -1.499678 -0.421469
C  2.685814 -0.93537 0.475711
C  2.967501 -0.109503 -0.612773
C  3.339344 -2.145566 0.641996
C  3.933409 -0.518013 -1.523242
C  4.278335 -2.551184 -0.293241
C  4.578204 -1.735939 -1.370499
C  2.213004 1.149215 -0.895184
C  -0.37847 -1.975167 0.842973
C  2.470978 3.447134 -1.383398
C  -2.598808 -1.057687 0.074656
C  2.149143 4.180988 -0.099739
C  -3.223166 1.115242 0.074082
C  -4.471543 0.770004 -0.448933
C  -4.648532 -0.577091 -0.671313
C  -1.701198 2.755523 0.819273
H  3.117658 -2.765423 1.497932
H  4.176191 0.114378 -2.366278
H  -0.520252 0.081141 0.920942
H  4.780236 -3.50082 -0.169532
H  5.319006 -2.043134 -2.096318
H  -1.969938 -2.967077 0.093116
H  1.588199 3.348989 -2.016863
H  3.237201 3.975352 -1.949527
H  3.037149 4.302413 0.51899
H  1.76492 5.173726 -0.335934
H  1.398157 3.656829 0.488965
H  -5.228728 1.508168 -0.660259
H  -0.905757 2.49749 0.120335
H  -1.495392 2.289398 1.783708
H  -1.740824 3.833789 0.94575
totalener: -2109.56114954 hartree
nucrepener: 2978.80306521 hartree
electener: -5088.36421475 hartree
oneelecener: -8819.51123500 hartree
twoeener: 3731.14702025 hartree
kineticenergy: 2103.07652182 hartree
xcener: -155.809775609071 hartree
chargesum: 0.0000000
charge: -0.038466 0.869777 -0.260444 -0.430638 -0.474535 -0.388673 -0.377146 -0.260624 -0.207845 -0.162056 -0.408898 -0.324208 -0.206202 0.099221 0.039036 -0.193474 -0.142817 -0.092420 0.423967 0.346296 0.012793 0.390942 -0.234309 0.384644 -0.273644 0.184434 -0.133385 0.139181 0.122102 0.212133 0.135931 0.133731 0.172298 0.091826 0.102062 0.095478 0.084436 0.081130 0.133252 0.107742 0.116516 0.130857
qa: -0.0385 0.8698 -0.2604 -0.4306 -0.4745 -0.3887 -0.3771 -0.2606 -0.2078 -0.1621 -0.4089 -0.3242 -0.2062 0.0992 0.0390 -0.1935 -0.1428 -0.0924 0.4240 0.3463 0.0128 0.3909 -0.2343 0.3846 -0.2736 0.1844 -0.1334 0.1392 0.1221 0.2121 0.1359 0.1337 0.1723 0.0918 0.1021 0.0955 0.0844 0.0811 0.1333 0.1077 0.1165 0.1309
va: 1.2666 5.8342 2.1475 2.0827 2.0151 2.1013 2.1414 2.1766 3.1093 3.1747 2.9921 3.0127 3.9496 3.6709 3.8625 4.0675 3.9773 3.9389 4.1080 4.4077 3.8700 4.1781 3.9285 4.0509 3.9780 4.2325 3.8600 1.0284 1.0207 1.0437 0.9988 0.9981 1.0340 1.0096 0.9963 1.0082 1.0083 1.0141 1.0197 1.0067 0.9951 0.9947
dispcorr: -0.024855230 hartree
energy: -2109.586004770331
dipole: 25.03204 -24.49981 0.53223 20.70842 -19.33037 1.37804 -2.42159 0.86697 -1.55462
magnitude: 2.14455 au
magnitude: 5.45102 debye
