program: Orca
programVersion: 4.2.1
elementType: Cl S O O O O O O N N N N C C C C C C C C C C C C C C C H H H H H H H H H H H H H H H
charge: 0
multiplicity: 1
keywords: wb97x-d3
keywords: def2-TZVPP
keywords: def2/J RIJCOSX GRIDX6 NOFINALGRIDX
keywords: grid4 nofinalgrid
keywords: scfconv7
keywords: smallprint printgap noloewdin
keywords: NOSOSCF
formula: C15H15ClN4O6S
InChI: InChI=1S/C15H15ClN4O6S/c1-3-26-13(21)9-6-4-5-7-10(9)27(23,24)20-15(22)19-14-17-11(16)8-12(18-14)25-2/h4-8,19-20H,3H2,1-2H3
42 atoms
Cl -6.050083 -1.071001 -1.640545
S  1.51503 -0.634106 1.845539
O  2.765451 2.325861 -0.803945
O  1.804797 -1.602056 2.871482
O  1.516347 0.784646 2.133813
O  0.809097 1.2483 -0.699089
O  0.299239 -3.107703 0.675149
O  -3.102114 2.198815 0.729097
N  -0.008206 -0.919261 1.228039
N  -1.662814 -2.137078 0.136169
N  -2.361081 0.059716 0.454572
N  -3.703573 -1.534956 -0.654614
C  2.618665 -0.940192 0.480765
C  2.839815 0.018494 -0.508802
C  3.339988 -2.122484 0.501961
C  3.815175 -0.228996 -1.466074
C  4.288516 -2.365552 -0.479312
C  4.529296 -1.417411 -1.457715
C  2.009338 1.252303 -0.652458
C  -0.387705 -2.119275 0.692515
C  2.099859 3.578268 -1.00416
C  -2.605928 -1.154787 -0.020586
C  3.158889 4.638976 -1.180872
C  -3.292791 0.979227 0.277492
C  -4.494269 0.697247 -0.376929
C  -4.617757 -0.601617 -0.816391
C  -1.872847 2.504703 1.382355
H  3.163027 -2.847483 1.28247
H  4.011112 0.506996 -2.233751
H  -0.61301 -0.108398 1.077758
H  4.843215 -3.293592 -0.46774
H  5.276701 -1.597517 -2.21856
H  -1.921335 -3.031431 -0.254247
H  1.467918 3.793714 -0.139678
H  1.450383 3.516811 -1.880334
H  2.681587 5.607867 -1.325306
H  3.802716 4.710041 -0.30517
H  3.782877 4.441802 -2.052011
H  -5.257753 1.444779 -0.522193
H  -1.947847 3.550903 1.664904
H  -1.02007 2.364161 0.718844
H  -1.732304 1.901112 2.279513
totalener: -2109.56155435 hartree
nucrepener: 2963.89752496 hartree
electener: -5073.45907931 hartree
oneelecener: -8789.73869796 hartree
twoeener: 3716.27961865 hartree
kineticenergy: 2103.07900665 hartree
xcener: -155.809021035308 hartree
chargesum: -0.0000000
charge: -0.039308 0.866851 -0.257462 -0.431537 -0.472950 -0.390405 -0.376271 -0.259863 -0.205894 -0.161638 -0.403856 -0.324043 -0.194842 0.093732 0.040723 -0.188920 -0.141683 -0.092147 0.417510 0.344208 0.028298 0.388739 -0.232564 0.383577 -0.272294 0.182879 -0.129354 0.138538 0.120142 0.209075 0.135966 0.133990 0.171962 0.088451 0.091075 0.079658 0.092231 0.082953 0.132815 0.128038 0.107284 0.116334
qa: -0.0393 0.8669 -0.2575 -0.4315 -0.4729 -0.3904 -0.3763 -0.2599 -0.2059 -0.1616 -0.4039 -0.3240 -0.1948 0.0937 0.0407 -0.1889 -0.1417 -0.0921 0.4175 0.3442 0.0283 0.3887 -0.2326 0.3836 -0.2723 0.1829 -0.1294 0.1385 0.1201 0.2091 0.1360 0.1340 0.1720 0.0885 0.0911 0.0797 0.0922 0.0830 0.1328 0.1280 0.1073 0.1163
va: 1.2656 5.8392 2.1480 2.0801 2.0191 2.1017 2.1427 2.1746 3.1068 3.1740 2.9911 3.0143 3.9385 3.6821 3.8607 4.0705 3.9770 3.9401 4.1017 4.4110 3.8755 4.1817 3.9671 4.0541 3.9775 4.2317 3.8594 1.0288 1.0219 1.0510 0.9988 0.9980 1.0340 0.9945 0.9970 1.0082 1.0045 1.0050 1.0195 0.9953 1.0034 0.9964
dispcorr: -0.023871580 hartree
energy: -2109.585425932371
dipole: 26.61901 -26.08107 0.53794 22.30901 -20.67072 1.63829 -2.98358 1.50036 -1.48322
magnitude: 2.27449 au
magnitude: 5.78129 debye
