program: Orca
programVersion: 4.2.1
elementType: Cl S O O O O O O N N N N C C C C C C C C C C C C C C C H H H H H H H H H H H H H H H
charge: 0
multiplicity: 1
keywords: wb97x-d3
keywords: def2-TZVPP
keywords: def2/J RIJCOSX GRIDX6 NOFINALGRIDX
keywords: grid4 nofinalgrid
keywords: scfconv7
keywords: smallprint printgap noloewdin
keywords: NOSOSCF
formula: C15H15ClN4O6S
InChI: InChI=1S/C15H15ClN4O6S/c1-3-26-13(21)9-6-4-5-7-10(9)27(23,24)20-15(22)19-14-17-11(16)8-12(18-14)25-2/h4-8,19-20H,3H2,1-2H3
42 atoms
Cl -6.087532 -1.257949 -1.516455
S  1.513722 -0.622189 1.86681
O  2.673084 2.308966 -0.851647
O  1.831183 -1.567539 2.905443
O  1.497314 0.801351 2.129749
O  0.74186 1.19261 -0.701204
O  0.325866 -3.132034 0.75652
O  -3.176338 2.110206 0.759775
N  -0.014221 -0.94066 1.275773
N  -1.661514 -2.207927 0.228884
N  -2.397711 -0.018967 0.515386
N  -3.721402 -1.658869 -0.549348
C  2.606943 -0.935014 0.494515
C  2.800439 0.00958 -0.514204
C  3.353605 -2.10114 0.53205
C  3.774525 -0.234272 -1.473832
C  4.300444 -2.341635 -0.451423
C  4.514233 -1.406631 -1.448664
C  1.942274 1.222504 -0.671375
C  -0.379583 -2.156564 0.766764
C  1.977267 3.543729 -1.058142
C  -2.624166 -1.246158 0.064865
C  3.010149 4.624063 -1.26727
C  -3.348621 0.87931 0.331505
C  -4.550246 0.563642 -0.306721
C  -4.653857 -0.745705 -0.719314
C  -1.955102 2.444129 1.413952
H  3.197711 -2.815436 1.326814
H  3.949472 0.491654 -2.255983
H  -0.63191 -0.141806 1.116412
H  4.875456 -3.257002 -0.427091
H  5.261592 -1.584242 -2.210155
H  -1.908592 -3.112903 -0.143809
H  1.35552 3.757426 -0.185846
H  1.31462 3.456092 -1.922082
H  3.623529 4.428235 -2.1461
H  2.509738 5.580546 -1.416714
H  3.666853 4.72105 -0.403684
H  -5.329217 1.293707 -0.458416
H  -1.097305 2.315159 0.754254
H  -1.806667 1.84918 2.315637
H  -2.050808 3.490613 1.689479
totalener: -2109.56150517 hartree
nucrepener: 2963.31758721 hartree
electener: -5072.87909238 hartree
oneelecener: -8788.58513661 hartree
twoeener: 3715.70604423 hartree
kineticenergy: 2103.07829036 hartree
xcener: -155.808704155540 hartree
chargesum: 0.0000000
charge: -0.039667 0.867376 -0.257397 -0.431531 -0.472755 -0.389875 -0.376210 -0.259898 -0.205826 -0.161471 -0.404801 -0.324222 -0.193942 0.093186 0.039313 -0.188501 -0.141335 -0.091887 0.416459 0.343939 0.028373 0.389382 -0.232678 0.384096 -0.272438 0.182832 -0.128479 0.138623 0.120130 0.209402 0.135841 0.133841 0.171997 0.088433 0.091153 0.082928 0.079621 0.092281 0.132965 0.105969 0.116430 0.128343
qa: -0.0397 0.8674 -0.2574 -0.4315 -0.4728 -0.3899 -0.3762 -0.2599 -0.2058 -0.1615 -0.4048 -0.3242 -0.1939 0.0932 0.0393 -0.1885 -0.1413 -0.0919 0.4165 0.3439 0.0284 0.3894 -0.2327 0.3841 -0.2724 0.1828 -0.1285 0.1386 0.1201 0.2094 0.1358 0.1338 0.1720 0.0884 0.0912 0.0829 0.0796 0.0923 0.1330 0.1060 0.1164 0.1283
va: 1.2652 5.8386 2.1479 2.0802 2.0191 2.1020 2.1426 2.1743 3.1075 3.1739 2.9897 3.0143 3.9404 3.6823 3.8625 4.0698 3.9768 3.9401 4.1030 4.4114 3.8758 4.1812 3.9670 4.0533 3.9778 4.2319 3.8603 1.0289 1.0220 1.0496 0.9988 0.9981 1.0340 0.9944 0.9970 1.0050 1.0082 1.0045 1.0194 1.0027 0.9964 0.9952
dispcorr: -0.023834789 hartree
energy: -2109.585339955950
dipole: 26.11856 -25.63201 0.48655 22.72287 -21.10122 1.62166 -3.59437 2.09292 -1.50145
magnitude: 2.26293 au
magnitude: 5.75191 debye
