program: Orca
programVersion: 4.2.1
elementType: Cl S O O O O O O N N N N C C C C C C C C C C C C C C C H H H H H H H H H H H H H H H
charge: 0
multiplicity: 1
keywords: wb97x-d3
keywords: def2-TZVPP
keywords: def2/J RIJCOSX GRIDX6 NOFINALGRIDX
keywords: grid4 nofinalgrid
keywords: scfconv7
keywords: smallprint printgap noloewdin
keywords: NOSOSCF
formula: C15H15ClN4O6S
InChI: InChI=1S/C15H15ClN4O6S/c1-3-26-13(21)9-6-4-5-7-10(9)27(23,24)20-15(22)19-14-17-11(16)8-12(18-14)25-2/h4-8,19-20H,3H2,1-2H3
42 atoms
Cl -5.964152 -0.955234 -1.891224
S  1.499889 -0.600493 1.830513
O  2.951902 2.331818 -0.660989
O  1.724589 -1.565517 2.874927
O  1.521496 0.820625 2.107071
O  0.962456 1.313397 -0.761384
O  0.27577 -3.05853 0.647646
O  -3.018966 2.314056 0.482991
N  -0.003815 -0.854994 1.151678
N  -1.647096 -2.060315 0.027062
N  -2.310363 0.156312 0.276226
N  -3.653542 -1.438817 -0.832244
C  2.647901 -0.941295 0.512798
C  2.934997 0.014227 -0.461499
C  3.328159 -2.147234 0.55352
C  3.934261 -0.259747 -1.386155
C  4.301496 -2.416318 -0.395874
C  4.607105 -1.471791 -1.360146
C  2.154542 1.279195 -0.618352
C  -0.391612 -2.056786 0.62549
C  2.34187 3.615927 -0.835737
C  -2.565933 -1.06401 -0.17784
C  3.443303 4.647481 -0.861646
C  -3.220116 1.088223 0.053363
C  -4.408115 0.813489 -0.628172
C  -4.544969 -0.492913 -1.040733
C  -1.802957 2.611748 1.164343
H  3.099595 -2.869338 1.32319
H  4.181598 0.474211 -2.141108
H  -0.583332 -0.032888 0.967613
H  4.825053 -3.361991 -0.371276
H  5.374533 -1.673241 -2.095334
H  -1.911664 -2.957198 -0.353434
H  1.649676 3.801312 -0.011466
H  1.764015 3.629374 -1.76258
H  3.0092 5.639626 -0.982484
H  4.015429 4.64293 0.065218
H  4.129944 4.48061 -1.690984
H  -5.152708 1.571587 -0.811803
H  -0.935306 2.447543 0.526021
H  -1.695825 2.020788 2.074484
H  -1.868916 3.66347 1.427905
totalener: -2109.56150734 hartree
nucrepener: 2962.67878965 hartree
electener: -5072.24029699 hartree
oneelecener: -8787.27872087 hartree
twoeener: 3715.03842388 hartree
kineticenergy: 2103.07730296 hartree
xcener: -155.808359107751 hartree
chargesum: 0.0000000
charge: -0.039097 0.866535 -0.255288 -0.429941 -0.473669 -0.387579 -0.377238 -0.259924 -0.208471 -0.161994 -0.406253 -0.324303 -0.193687 0.100942 0.038991 -0.189529 -0.142499 -0.093369 0.409566 0.346081 0.028297 0.389940 -0.232587 0.383879 -0.271635 0.182906 -0.131496 0.138802 0.119816 0.210916 0.136054 0.134122 0.172159 0.087914 0.091190 0.078966 0.092142 0.083254 0.132974 0.109054 0.115878 0.128182
qa: -0.0391 0.8665 -0.2553 -0.4299 -0.4737 -0.3876 -0.3772 -0.2599 -0.2085 -0.1620 -0.4063 -0.3243 -0.1937 0.1009 0.0390 -0.1895 -0.1425 -0.0934 0.4096 0.3461 0.0283 0.3899 -0.2326 0.3839 -0.2716 0.1829 -0.1315 0.1388 0.1198 0.2109 0.1361 0.1341 0.1722 0.0879 0.0912 0.0790 0.0921 0.0833 0.1330 0.1091 0.1159 0.1282
va: 1.2657 5.8383 2.1489 2.0821 2.0177 2.1053 2.1412 2.1750 3.1078 3.1747 2.9906 3.0137 3.9320 3.6865 3.8628 4.0705 3.9776 3.9409 4.1083 4.4085 3.8754 4.1800 3.9684 4.0539 3.9769 4.2321 3.8591 1.0286 1.0208 1.0482 0.9988 0.9979 1.0340 0.9950 0.9965 1.0083 1.0047 1.0050 1.0195 1.0042 0.9962 0.9955
dispcorr: -0.023890142 hartree
energy: -2109.585397482139
dipole: 27.45999 -26.83247 0.62752 21.98541 -20.36939 1.61602 -1.44832 0.02709 -1.42123
magnitude: 2.24170 au
magnitude: 5.69794 debye
