program: Orca
programVersion: 4.2.1
elementType: S O O O O O O O N N N N C C C C C C C C C C C C C C C H H H H H H H H H H H H H H H H H H
charge: 0
multiplicity: 1
keywords: wb97x-d3
keywords: def2-TZVPP
keywords: def2/J RIJCOSX GRIDX6 NOFINALGRIDX
keywords: grid4 nofinalgrid
keywords: scfconv7
keywords: smallprint printgap noloewdin
keywords: NOSOSCF
formula: C15H18N4O7S
InChI: InChI=1S/C15H18N4O7S/c1-4-25-10-7-5-6-8-11(10)26-27(21,22)19-15(20)18-14-16-12(23-2)9-13(17-14)24-3/h5-9,18-19H,4H2,1-3H3
45 atoms
S  2.488105 0.677194 -1.475427
O  2.735624 0.257791 0.066315
O  0.536533 -1.142474 0.885391
O  2.350679 2.108305 -1.558896
O  3.515472 -0.020163 -2.189757
O  -2.221185 2.388381 0.020959
O  -4.60914 -1.561618 0.483824
O  1.525611 -2.120015 -2.103811
N  0.993387 0.08885 -1.824933
N  -0.636996 -1.557427 -1.766182
N  -1.444153 0.457264 -0.93239
N  -2.626833 -1.565012 -0.656354
C  1.888418 0.803871 1.027583
C  0.796503 0.052959 1.457609
C  2.158688 2.055226 1.55675
C  -0.037503 0.588122 2.433243
C  1.321654 2.57334 2.532153
C  0.221521 1.842231 2.962013
C  0.768208 -2.30802 1.683991
C  0.700894 -1.26396 -1.887939
C  -1.606373 -0.846824 -1.082037
C  2.236845 -2.639021 1.804382
C  -2.36118 1.094774 -0.210612
C  -3.555081 -0.907947 0.025544
C  -3.471741 0.450518 0.305436
C  -1.046365 3.053011 -0.435691
C  -4.703951 -2.967013 0.262819
H  3.021594 2.612571 1.218306
H  -0.900041 0.022246 2.762675
H  1.524559 3.55057 2.947198
H  -0.44131 2.250711 3.712555
H  0.23311 -3.112048 1.180221
H  0.314167 -2.181116 2.671244
H  0.194732 0.698141 -1.56819
H  -0.838321 -2.544574 -1.859444
H  2.79102 -1.863352 2.334834
H  2.350047 -3.564288 2.37012
H  2.691025 -2.785689 0.824541
H  -4.221068 0.968182 0.885776
H  -1.153415 4.088257 -0.124448
H  -0.147777 2.642708 0.0253
H  -0.956925 3.017975 -1.521431
H  -4.749137 -3.206884 -0.798827
H  -3.872447 -3.503005 0.719288
H  -5.630935 -3.275395 0.738021
elementType: S O N C H
totalener: -1726.38572388 hartree
nucrepener: 3066.87397374 hartree
electener: -4793.25969762 hartree
oneelecener: -8465.81842107 hartree
twoeener: 3672.55872345 hartree
cpcmener: -0.04350855 hartree
kineticenergy: 1720.11876879 hartree
xcener: -141.535984709929 hartree
chargesum: 0.0000000
charge: 0.905391 -0.289466 -0.332683 -0.476360 -0.463020 -0.296483 -0.299963 -0.448324 -0.196399 -0.157933 -0.407331 -0.402423 0.117870 0.215407 -0.075056 -0.225648 -0.175955 -0.129260 0.055573 0.355239 0.351322 -0.259341 0.403681 0.427481 -0.320578 -0.085685 -0.115403 0.144362 0.153236 0.162960 0.164334 0.092481 0.095288 0.213492 0.191751 0.087976 0.106459 0.084207 0.144688 0.143453 0.041600 0.137559 0.114370 0.114152 0.132977
qa: 0.9054 -0.2895 -0.3327 -0.4764 -0.4630 -0.2965 -0.3000 -0.4483 -0.1964 -0.1579 -0.4073 -0.4024 0.1179 0.2154 -0.0751 -0.2256 -0.1760 -0.1293 0.0556 0.3552 0.3513 -0.2593 0.4037 0.4275 -0.3206 -0.0857 -0.1154 0.1444 0.1532 0.1630 0.1643 0.0925 0.0953 0.2135 0.1918 0.0880 0.1065 0.0842 0.1447 0.1435 0.0416 0.1376 0.1144 0.1142 0.1330
va: 6.0758 2.0408 1.9272 2.0082 2.0405 2.1135 2.1223 2.0557 3.0882 3.1654 2.9564 2.9456 3.7921 3.8056 3.8716 3.9636 3.9096 3.8567 3.8245 4.4418 4.2654 3.9241 3.9655 4.0056 3.9341 3.8318 3.8478 1.0074 0.9998 0.9892 0.9878 0.9975 0.9995 1.0809 1.0165 0.9997 1.0095 1.0125 1.0175 0.9979 1.0026 0.9945 0.9950 0.9955 0.9934
dispcorr: -0.031833559 hartree
energy: -1726.417557434975
dipole: -9.17279 5.60037 -3.57242 -5.70753 5.67568 -0.03185 16.47646 -13.52922 2.94725
magnitude: 4.63135 au
magnitude: 11.77197 debye
