program: Orca
programVersion: 4.2.1
elementType: S O O O O O O O N N N N C C C C C C C C C C C C C C C H H H H H H H H H H H H H H H H H H
charge: 0
multiplicity: 1
keywords: wb97x-d3
keywords: def2-TZVPP
keywords: def2/J RIJCOSX GRIDX6 NOFINALGRIDX
keywords: grid4 nofinalgrid
keywords: scfconv7
keywords: smallprint printgap noloewdin
keywords: NOSOSCF
formula: C15H18N4O7S
InChI: InChI=1S/C15H18N4O7S/c1-4-25-10-7-5-6-8-11(10)26-27(21,22)19-15(20)18-14-16-12(23-2)9-13(17-14)24-3/h5-9,18-19H,4H2,1-3H3
45 atoms
S  2.677342 1.161961 0.552325
O  2.681644 0.056472 -0.627833
O  0.412426 -1.432585 -0.309454
O  3.821989 0.817446 1.342969
O  2.522964 2.469183 -0.031885
O  -2.271947 2.244819 -0.782229
O  -4.534013 -1.421104 0.939356
O  1.905596 -0.917177 2.617377
N  1.275007 0.893465 1.365215
N  -0.297576 -0.485597 2.365676
N  -1.289673 0.935832 0.818202
N  -2.421226 -0.947888 1.675943
C  1.671182 0.124789 -1.583514
C  0.543464 -0.676379 -1.42009
C  1.818155 0.94975 -2.686504
C  -0.454123 -0.628357 -2.387669
C  0.819745 0.980527 -3.647108
C  -0.317359 0.197785 -3.491301
C  0.530674 -2.850929 -0.468359
C  1.033992 -0.236132 2.131047
C  -1.379785 -0.145985 1.573422
C  1.972281 -3.29547 -0.539202
C  -2.325354 1.201634 0.027938
C  -3.457897 -0.653929 0.902876
C  -3.470314 0.42505 0.027275
C  -1.066415 3.000304 -0.860861
C  -4.534926 -2.576802 1.77411
H  2.711053 1.54949 -2.800695
H  -1.344417 -1.231669 -2.260931
H  0.927989 1.620985 -4.511128
H  -1.104283 0.230481 -4.232357
H  -0.022719 -3.175892 -1.354142
H  0.036121 -3.281657 0.401604
H  0.42826 1.350616 0.979737
H  -0.451763 -1.297958 2.94886
H  2.010973 -4.383763 -0.594325
H  2.47872 -2.905263 -1.422982
H  2.525487 -2.983384 0.346536
H  -4.313362 0.640124 -0.612563
H  -0.244246 2.400298 -1.252679
H  -1.269305 3.807915 -1.558403
H  -0.790279 3.428135 0.102594
H  -4.444002 -2.314625 2.82748
H  -5.495284 -3.056415 1.607258
H  -3.738112 -3.268849 1.503597
elementType: S O N C H
totalener: -1726.38556677 hartree
nucrepener: 3067.70219794 hartree
electener: -4794.08776470 hartree
oneelecener: -8467.46199493 hartree
twoeener: 3673.37423022 hartree
cpcmener: -0.04380821 hartree
kineticenergy: 1720.11692295 hartree
xcener: -141.535294874029 hartree
chargesum: 0.0000000
charge: 0.906672 -0.290299 -0.333330 -0.464952 -0.475427 -0.296420 -0.299591 -0.450072 -0.197711 -0.158306 -0.406282 -0.399082 0.117477 0.221962 -0.080558 -0.230064 -0.173696 -0.130037 0.060800 0.357478 0.348820 -0.261391 0.403933 0.425569 -0.320014 -0.088752 -0.115267 0.145701 0.153383 0.163017 0.163957 0.094080 0.092322 0.213682 0.191608 0.106198 0.087313 0.083602 0.145299 0.049775 0.143391 0.133506 0.114928 0.132495 0.114285
qa: 0.9067 -0.2903 -0.3333 -0.4650 -0.4754 -0.2964 -0.2996 -0.4501 -0.1977 -0.1583 -0.4063 -0.3991 0.1175 0.2220 -0.0806 -0.2301 -0.1737 -0.1300 0.0608 0.3575 0.3488 -0.2614 0.4039 0.4256 -0.3200 -0.0888 -0.1153 0.1457 0.1534 0.1630 0.1640 0.0941 0.0923 0.2137 0.1916 0.1062 0.0873 0.0836 0.1453 0.0498 0.1434 0.1335 0.1149 0.1325 0.1143
va: 6.0740 2.0406 1.9255 2.0376 2.0093 2.1133 2.1215 2.0533 3.0862 3.1666 2.9577 2.9452 3.7928 3.8109 3.8779 3.9681 3.9085 3.8616 3.8204 4.4373 4.2675 3.9298 3.9670 4.0069 3.9331 3.8358 3.8482 1.0066 0.9992 0.9887 0.9881 1.0004 0.9976 1.0810 1.0166 1.0094 1.0000 1.0130 1.0171 1.0029 0.9976 0.9941 0.9948 0.9936 0.9951
dispcorr: -0.031837135 hartree
energy: -1726.417403901603
dipole: -11.56719 7.54715 -4.02004 -12.44848 11.19374 -1.25474 -9.94923 7.94137 -2.00786
magnitude: 4.66547 au
magnitude: 11.85869 debye
