program: Orca
programVersion: 4.2.1
elementType: S O O O O O O O N N N N C C C C C C C C C C C C C C C H H H H H H H H H H H H H H H H H H
charge: 0
multiplicity: 1
keywords: wb97x-d3
keywords: def2-TZVPP
keywords: def2/J RIJCOSX GRIDX6 NOFINALGRIDX
keywords: grid4 nofinalgrid
keywords: scfconv7
keywords: smallprint printgap noloewdin
keywords: NOSOSCF
formula: C15H18N4O7S
InChI: InChI=1S/C15H18N4O7S/c1-4-25-10-7-5-6-8-11(10)26-27(21,22)19-15(20)18-14-16-12(23-2)9-13(17-14)24-3/h5-9,18-19H,4H2,1-3H3
45 atoms
S  2.004855 1.852837 -0.423412
O  2.73167 0.434224 -0.188227
O  0.897766 -1.479151 -0.160126
O  2.318501 2.585548 0.773175
O  2.344421 2.354308 -1.726234
O  -1.510115 1.426748 3.582191
O  -5.011349 -0.969967 1.7009
O  0.031634 0.787861 -2.469177
N  0.396796 1.5318 -0.334728
N  -1.594481 0.508865 -0.934353
N  -1.525585 0.980675 1.339911
N  -3.306604 -0.225702 0.372318
C  2.744151 -0.520063 -1.2068
C  1.795838 -1.545534 -1.155813
C  3.715736 -0.465308 -2.183685
C  1.843606 -2.523211 -2.144714
C  3.754991 -1.449932 -3.160884
C  2.815127 -2.467507 -3.135669
C  -0.019855 -2.554089 0.037679
C  -0.345756 0.925705 -1.329049
C  -2.156991 0.419028 0.323083
C  0.6229 -3.768432 0.669664
C  -2.101461 0.880497 2.534983
C  -3.866846 -0.323089 1.571107
C  -3.304185 0.222507 2.719124
C  -0.267266 2.103095 3.399631
C  -5.600517 -1.576512 0.552216
H  4.44558 0.33307 -2.173642
H  1.129749 -3.334691 -2.161079
H  4.5133 -1.418219 -3.930315
H  2.832435 -3.239753 -3.892808
H  -0.526602 -2.80461 -0.897935
H  -0.77495 -2.151905 0.711435
H  -0.029335 1.517968 0.610459
H  -2.132271 0.074717 -1.673581
H  1.08329 -3.513909 1.624127
H  -0.147693 -4.515754 0.859356
H  1.379759 -4.230482 0.03615
H  -3.772419 0.137697 3.688553
H  0.005564 2.485977 4.378689
H  0.513132 1.421342 3.060539
H  -0.36202 2.939637 2.707484
H  -5.864252 -0.837416 -0.203222
H  -4.943745 -2.325782 0.111847
H  -6.50485 -2.06048 0.909846
elementType: S O N C H
totalener: -1726.38887123 hartree
nucrepener: 2945.09778610 hartree
electener: -4671.48665732 hartree
oneelecener: -8222.70370152 hartree
twoeener: 3551.21704420 hartree
cpcmener: -0.04715222 hartree
kineticenergy: 1720.09251530 hartree
xcener: -141.534028941578 hartree
chargesum: -0.0000000
charge: 0.926128 -0.298588 -0.334530 -0.487071 -0.463216 -0.295129 -0.298252 -0.438796 -0.179234 -0.123479 -0.404500 -0.408350 0.111722 0.293528 -0.130861 -0.176814 -0.186890 -0.184994 0.026418 0.309319 0.314431 -0.255027 0.427610 0.420982 -0.314090 -0.129376 -0.115565 0.147082 0.147596 0.164004 0.164884 0.102114 0.102712 0.202885 0.195730 0.092031 0.100686 0.092511 0.147703 0.140517 0.110338 0.120178 0.115288 0.114773 0.133589
qa: 0.9261 -0.2986 -0.3345 -0.4871 -0.4632 -0.2951 -0.2983 -0.4388 -0.1792 -0.1235 -0.4045 -0.4084 0.1117 0.2935 -0.1309 -0.1768 -0.1869 -0.1850 0.0264 0.3093 0.3144 -0.2550 0.4276 0.4210 -0.3141 -0.1294 -0.1156 0.1471 0.1476 0.1640 0.1649 0.1021 0.1027 0.2029 0.1957 0.0920 0.1007 0.0925 0.1477 0.1405 0.1103 0.1202 0.1153 0.1148 0.1336
va: 6.0632 2.0555 2.0674 2.0180 2.0224 2.1359 2.1251 2.0637 3.0846 3.1797 2.9684 2.9440 3.7916 3.8484 4.0058 3.8485 3.9037 3.9327 3.8537 4.4641 4.2609 3.9452 3.9701 4.0093 3.9344 3.8387 3.8458 1.0038 1.0042 0.9872 0.9881 0.9916 0.9918 1.0920 1.0142 1.0043 1.0069 1.0029 1.0156 0.9962 0.9956 0.9898 0.9951 0.9954 0.9931
dispcorr: -0.026589936 hartree
energy: -1726.415461162770
dipole: -8.43967 5.54803 -2.89165 -20.46289 17.43223 -3.03066 3.97557 -2.76834 1.20723
magnitude: 4.35935 au
magnitude: 11.08058 debye
