program: Orca
programVersion: 4.2.1
elementType: S O O O O O O O N N N N C C C C C C C C C C C C C C C H H H H H H H H H H H H H H H H H H
charge: 0
multiplicity: 1
keywords: wb97x-d3
keywords: def2-TZVPP
keywords: def2/J RIJCOSX GRIDX6 NOFINALGRIDX
keywords: grid4 nofinalgrid
keywords: scfconv7
keywords: smallprint printgap noloewdin
keywords: NOSOSCF
formula: C15H18N4O7S
InChI: InChI=1S/C15H18N4O7S/c1-4-25-10-7-5-6-8-11(10)26-27(21,22)19-15(20)18-14-16-12(23-2)9-13(17-14)24-3/h5-9,18-19H,4H2,1-3H3
45 atoms
S  2.100087 1.77794 -0.366961
O  2.110717 0.756752 -1.61659
O  0.388385 -1.208599 -1.16684
O  3.343766 1.672346 0.343506
O  1.659247 3.011114 -0.958269
O  -4.838538 -0.97584 2.033014
O  -3.180671 2.642511 -0.3527
O  1.899881 -0.402774 1.737874
N  0.856324 1.278277 0.584246
N  -0.342211 -0.227939 1.874272
N  -2.584543 -0.602337 1.966267
N  -1.749703 1.231793 0.739078
C  2.601734 -0.538577 -1.452809
C  1.678822 -1.569924 -1.256235
C  3.956728 -0.77616 -1.551044
C  2.167983 -2.867594 -1.144909
C  4.431041 -2.075746 -1.441863
C  3.532611 -3.109905 -1.235437
C  -0.62138 -2.212994 -1.075619
C  0.888098 0.17169 1.409895
C  -1.61319 0.158198 1.499221
C  -0.886936 -2.90624 -2.393411
C  -3.815236 -0.250702 1.617851
C  -2.990397 1.576742 0.403681
C  -4.093465 0.855329 0.823291
C  -4.59129 -2.14536 2.81049
C  -2.049451 3.395874 -0.785838
H  4.636566 0.047009 -1.725609
H  1.500493 -3.703009 -0.986983
H  5.490869 -2.27216 -1.520574
H  3.888531 -4.127532 -1.147933
H  -1.51635 -1.677347 -0.761835
H  -0.38163 -2.928475 -0.284472
H  -0.090321 1.625118 0.342141
H  -0.305825 -1.03344 2.485591
H  -1.714495 -3.603902 -2.263055
H  -1.172845 -2.188347 -3.161925
H  -0.032132 -3.476095 -2.756759
H  -5.101036 1.130391 0.548809
H  -3.991631 -2.872035 2.263278
H  -4.100182 -1.907574 3.753173
H  -5.569204 -2.571807 3.014974
H  -1.400051 2.807077 -1.434145
H  -2.451885 4.227416 -1.357053
H  -1.481007 3.789592 0.056578
elementType: S O N C H
totalener: -1726.38857366 hartree
nucrepener: 2947.12627901 hartree
electener: -4673.51485267 hartree
oneelecener: -8226.75773244 hartree
twoeener: 3553.24287977 hartree
cpcmener: -0.04691572 hartree
kineticenergy: 1720.09065180 hartree
xcener: -141.533284782703 hartree
chargesum: -0.0000000
charge: 0.927061 -0.299600 -0.334993 -0.460645 -0.484998 -0.297896 -0.295144 -0.438888 -0.181170 -0.123598 -0.406746 -0.404747 0.107467 0.299483 -0.129070 -0.180543 -0.188867 -0.184536 0.029456 0.309103 0.310781 -0.257004 0.421545 0.426893 -0.311540 -0.116553 -0.129048 0.147551 0.147145 0.163540 0.164867 0.101887 0.102054 0.202993 0.195578 0.100398 0.092353 0.093267 0.147345 0.115117 0.114853 0.134194 0.109481 0.140198 0.120976
qa: 0.9271 -0.2996 -0.3350 -0.4606 -0.4850 -0.2979 -0.2951 -0.4389 -0.1812 -0.1236 -0.4067 -0.4047 0.1075 0.2995 -0.1291 -0.1805 -0.1889 -0.1845 0.0295 0.3091 0.3108 -0.2570 0.4215 0.4269 -0.3115 -0.1166 -0.1290 0.1476 0.1471 0.1635 0.1649 0.1019 0.1021 0.2030 0.1956 0.1004 0.0924 0.0933 0.1473 0.1151 0.1149 0.1342 0.1095 0.1402 0.1210
va: 6.0603 2.0552 2.0666 2.0258 2.0201 2.1246 2.1360 2.0635 3.0858 3.1788 2.9404 2.9704 3.7982 3.8413 4.0021 3.8514 3.9060 3.9317 3.8503 4.4653 4.2636 3.9465 4.0065 3.9689 3.9352 3.8459 3.8394 1.0037 1.0050 0.9874 0.9880 0.9925 0.9915 1.0915 1.0143 1.0070 1.0040 1.0029 1.0156 0.9952 0.9952 0.9930 0.9959 0.9964 0.9900
dispcorr: -0.026663896 hartree
energy: -1726.415237552809
dipole: -13.22139 9.72077 -3.50062 -17.61826 15.05604 -2.56223 -5.04300 5.09727 0.05427
magnitude: 4.33847 au
magnitude: 11.02751 debye
