program: Orca
programVersion: 4.2.1
elementType: S O O O O O O O N N N N C C C C C C C C C C C C C C C H H H H H H H H H H H H H H H H H H
charge: 0
multiplicity: 1
keywords: wb97x-d3
keywords: def2-TZVPP
keywords: def2/J RIJCOSX GRIDX6 NOFINALGRIDX
keywords: grid4 nofinalgrid
keywords: scfconv7
keywords: smallprint printgap noloewdin
keywords: NOSOSCF
formula: C15H18N4O7S
InChI: InChI=1S/C15H18N4O7S/c1-4-25-10-7-5-6-8-11(10)26-27(21,22)19-15(20)18-14-16-12(23-2)9-13(17-14)24-3/h5-9,18-19H,4H2,1-3H3
45 atoms
S  2.160714 1.894544 -0.285769
O  2.809532 0.418316 -0.214217
O  0.870544 -1.360693 0.089438
O  2.500807 2.462688 0.990175
O  2.538772 2.524885 -1.519808
O  -1.269774 0.771153 3.609288
O  -4.910534 -1.05597 1.385782
O  0.120448 1.316206 -2.486269
N  0.539309 1.636558 -0.253502
N  -1.481643 0.783221 -0.995457
N  -1.36349 0.813358 1.325543
N  -3.197973 -0.133354 0.184438
C  2.555818 -0.473691 -1.256704
C  1.548336 -1.425152 -1.067898
C  3.317853 -0.427973 -2.40548
C  1.313713 -2.333602 -2.095959
C  3.077846 -1.344811 -3.418048
C  2.072905 -2.285209 -3.257339
C  -0.027572 -2.412845 0.440042
C  -0.231514 1.245427 -1.332395
C  -2.028811 0.47552 0.233915
C  0.68625 -3.674677 0.869738
C  -1.909764 0.478251 2.491358
C  -3.740376 -0.444473 1.354637
C  -3.131231 -0.165681 2.573013
C  0.020382 1.374231 3.527352
C  -5.559322 -1.382802 0.158148
H  4.10378 0.308765 -2.50323
H  0.541924 -3.085651 -2.008762
H  3.672678 -1.321319 -4.320011
H  1.872669 -3.002696 -4.041495
H  -0.732273 -2.607359 -0.37288
H  -0.602804 -2.016348 1.275991
H  0.117045 1.45131 0.676556
H  -2.047882 0.52009 -1.791477
H  -0.054895 -4.409304 1.184653
H  1.275074 -4.12414 0.070401
H  1.345443 -3.481116 1.715679
H  -3.579236 -0.435103 3.517901
H  -0.020636 2.350977 3.04588
H  0.350755 1.502195 4.553877
H  0.730391 0.728612 3.009236
H  -5.795044 -0.491966 -0.42242
H  -4.958273 -2.060984 -0.446313
H  -6.482812 -1.87994 0.440769
elementType: S O N C H
totalener: -1726.38847261 hartree
nucrepener: 2981.09888862 hartree
electener: -4707.48736123 hartree
oneelecener: -8294.44327050 hartree
twoeener: 3586.95590927 hartree
cpcmener: -0.04695474 hartree
kineticenergy: 1720.09639416 hartree
xcener: -141.534681403255 hartree
chargesum: -0.0000000
charge: 0.923623 -0.297355 -0.327198 -0.486133 -0.460517 -0.293583 -0.297292 -0.437830 -0.184424 -0.120128 -0.397302 -0.406537 0.080034 0.294472 -0.125856 -0.162406 -0.185581 -0.182848 0.023157 0.308905 0.317270 -0.255581 0.403682 0.418633 -0.300769 -0.122459 -0.116012 0.144878 0.149577 0.164152 0.164923 0.104179 0.102669 0.203093 0.195648 0.100840 0.092351 0.092454 0.147328 0.118435 0.140937 0.104382 0.115298 0.114665 0.134228
qa: 0.9236 -0.2974 -0.3272 -0.4861 -0.4605 -0.2936 -0.2973 -0.4378 -0.1844 -0.1201 -0.3973 -0.4065 0.0800 0.2945 -0.1259 -0.1624 -0.1856 -0.1828 0.0232 0.3089 0.3173 -0.2556 0.4037 0.4186 -0.3008 -0.1225 -0.1160 0.1449 0.1496 0.1642 0.1649 0.1042 0.1027 0.2031 0.1956 0.1008 0.0924 0.0925 0.1473 0.1184 0.1409 0.1044 0.1153 0.1147 0.1342
va: 6.0611 2.0550 2.0575 2.0161 2.0281 2.1332 2.1264 2.0654 3.0874 3.1823 2.9599 2.9460 3.7808 3.8220 3.9947 3.8433 3.9104 3.9322 3.8377 4.4522 4.2653 3.9520 3.9771 4.0119 3.9229 3.8413 3.8456 1.0058 1.0032 0.9869 0.9881 0.9916 0.9882 1.0942 1.0144 1.0066 1.0035 1.0042 1.0158 0.9894 0.9966 0.9976 0.9951 0.9951 0.9929
dispcorr: -0.028079102 hartree
energy: -1726.416551711610
dipole: -9.68051 6.53935 -3.14117 -21.05553 17.80285 -3.25268 3.84695 -2.81557 1.03138
magnitude: 4.63795 au
magnitude: 11.78873 debye
