program: Orca
programVersion: 4.2.1
elementType: S O O O O O O O N N N N C C C C C C C C C C C C C C C H H H H H H H H H H H H H H H H H H
charge: 0
multiplicity: 1
keywords: wb97x-d3
keywords: def2-TZVPP
keywords: def2/J RIJCOSX GRIDX6 NOFINALGRIDX
keywords: grid4 nofinalgrid
keywords: scfconv7
keywords: smallprint printgap noloewdin
keywords: NOSOSCF
formula: C15H18N4O7S
InChI: InChI=1S/C15H18N4O7S/c1-4-25-10-7-5-6-8-11(10)26-27(21,22)19-15(20)18-14-16-12(23-2)9-13(17-14)24-3/h5-9,18-19H,4H2,1-3H3
45 atoms
S  2.216119 1.837137 -0.204287
O  2.79091 0.328494 -0.196592
O  0.783803 -1.389167 0.022971
O  2.587014 2.335855 1.09203
O  2.623543 2.497391 -1.41316
O  -1.228979 0.711924 3.666885
O  -4.842145 -1.11024 1.394929
O  0.133651 1.457448 -2.416141
N  0.584457 1.65624 -0.175051
N  -1.461198 0.87911 -0.934177
N  -1.330833 0.826459 1.385716
N  -3.15815 -0.104515 0.220471
C  2.502402 -0.500836 -1.281193
C  1.457998 -1.419855 -1.138196
C  3.266321 -0.429061 -2.427842
C  1.186959 -2.264927 -2.210805
C  2.989449 -1.283041 -3.484921
C  1.946943 -2.188811 -3.370026
C  -0.152616 -2.425059 0.319903
C  -0.206383 1.333788 -1.263371
C  -1.996671 0.517187 0.285848
C  0.512903 -3.735032 0.677516
C  -1.866375 0.443158 2.541617
C  -3.685617 -0.472509 1.380858
C  -3.073968 -0.228678 2.605427
C  0.042054 1.356557 3.603379
C  -5.486308 -1.412773 0.158582
H  4.082217 0.278397 -2.489961
H  0.385024 -2.988284 -2.16067
H  3.585021 -1.238192 -4.385674
H  1.717568 -2.857245 -4.188834
H  -0.863796 -2.549629 -0.500758
H  -0.711814 -2.053991 1.178216
H  0.159579 1.449466 0.749596
H  -2.035578 0.65129 -1.735268
H  1.182637 -3.614139 1.528749
H  -0.255647 -4.456076 0.956452
H  1.080413 -4.163597 -0.148273
H  -3.510327 -0.542608 3.542058
H  0.366166 1.469418 4.63376
H  0.772912 0.746133 3.071811
H  -0.028075 2.342786 3.145203
H  -4.872194 -2.059871 -0.46661
H  -6.399058 -1.93694 0.426813
H  -5.741253 -0.510092 -0.39506
elementType: S O N C H
totalener: -1726.38834085 hartree
nucrepener: 2984.56181334 hartree
electener: -4710.95015419 hartree
oneelecener: -8301.34728484 hartree
twoeener: 3590.39713065 hartree
cpcmener: -0.04705058 hartree
kineticenergy: 1720.09029282 hartree
xcener: -141.533511253198 hartree
chargesum: -0.0000000
charge: 0.923639 -0.298581 -0.330120 -0.485963 -0.459543 -0.293803 -0.297514 -0.436565 -0.183839 -0.120742 -0.396552 -0.402914 0.079795 0.298057 -0.127014 -0.163044 -0.184704 -0.183458 0.025356 0.307206 0.310915 -0.256107 0.408750 0.417761 -0.300469 -0.123115 -0.116230 0.145074 0.149970 0.164093 0.165136 0.104710 0.100551 0.201399 0.195740 0.092775 0.101128 0.092176 0.146904 0.140676 0.104042 0.120282 0.114626 0.134271 0.115247
qa: 0.9236 -0.2986 -0.3301 -0.4860 -0.4595 -0.2938 -0.2975 -0.4366 -0.1838 -0.1207 -0.3966 -0.4029 0.0798 0.2981 -0.1270 -0.1630 -0.1847 -0.1835 0.0254 0.3072 0.3109 -0.2561 0.4088 0.4178 -0.3005 -0.1231 -0.1162 0.1451 0.1500 0.1641 0.1651 0.1047 0.1006 0.2014 0.1957 0.0928 0.1011 0.0922 0.1469 0.1407 0.1040 0.1203 0.1146 0.1343 0.1152
va: 6.0617 2.0542 2.0553 2.0164 2.0293 2.1350 2.1260 2.0670 3.0852 3.1814 2.9627 2.9436 3.7824 3.8203 3.9959 3.8433 3.9102 3.9332 3.8384 4.4545 4.2702 3.9545 3.9755 4.0095 3.9203 3.8405 3.8464 1.0059 1.0033 0.9870 0.9881 0.9912 0.9898 1.0963 1.0143 1.0042 1.0065 1.0036 1.0161 0.9963 0.9986 0.9889 0.9949 0.9930 0.9950
dispcorr: -0.028179344 hartree
energy: -1726.416520193316
dipole: -10.43087 7.18901 -3.24186 -20.93142 17.72478 -3.20664 2.87303 -1.97673 0.89630
magnitude: 4.64710 au
magnitude: 11.81199 debye
