program: Gaussian 09
title: 000069067
version: EM64L-G09RevD.01
frameworkgroup: C1[X(C14H12O4)]
method: RPBEPBE
basis: SDD
operation: Freq
keyword: #pfreq=noraman
keyword: PBEPBE/SDD
title: #p freq=noraman PBEPBE/SDD
converged: YES YES NO NO
title: Mulliken charges:
elementType: O O O O C C C C C C C C C C C C C C H H H H H H H H H H H H
charge: -0.292187 -0.292166 -0.219817 -0.219840 0.170358 0.170384 0.239737 0.239689 -0.397531 -0.397555 -0.353333 -0.353302 -0.210762 -0.210721 0.260241 0.260271 -0.751865 -0.751865 0.266369 0.266371 0.302441 0.302464 0.230969 0.230968 0.253028 0.249327 0.252985 0.253015 0.249326 0.253002
chargesum: 0.00000
title: Mulliken charges with hydrogens summed into heavy atoms:
elementType: O O O O C C C C C C C C C C C C C C
charge: -0.292187 -0.292166 -0.219817 -0.219840 0.170358 0.170384 0.239737 0.239689 -0.131162 -0.131185 -0.050892 -0.050839 0.020207 0.020247 0.260241 0.260271 0.003476 0.003478
polarizability: 2.59183818e+02 6.22924285e+00 1.91790430e+02 2.30077720e-03 1.27317627e-03 7.40544210e+01
1716.lowfreq: -5.4347 -3.1609 -0.0005 0.0004 0.0007 3.9068 23.4496 32.2739 41.3146
frequency: 23.4494 32.1036 41.3146 60.5126 69.3779 88.0886 96.8729 138.6011 158.6365 177.4381 220.0956 242.0247 255.2791 298.3919 324.2846 329.9276 465.9504 469.0014 479.9515 506.4671 508.4573 518.8088 550.5632 555.4896 565.3414 590.5319 668.4013 677.8978 712.4064 750.0427 752.0317 787.0135 801.6036 811.0085 834.8121 884.2138 932.1104 932.1535 945.8771 990.0806 992.9378 993.5678 997.7955 1039.7936 1039.8586 1067.6950 1071.3539 1121.6587 1164.1804 1172.4590 1184.7146 1185.7715 1214.0813 1223.0758 1243.3217 1370.4685 1384.3669 1384.7240 1403.5529 1409.1731 1430.8233 1449.1536 1452.7457 1453.9484 1454.3821 1454.3943 1508.6110 1576.7150 1590.2399 1631.2919 1658.4799 1661.9120 3008.3373 3008.3404 3096.5959 3096.6010 3144.4826 3144.5284 3145.4805 3145.6525 3184.7159 3184.7346 3212.6783 3212.9022
redmass: 9.8210 5.6923 2.5173 1.3820 1.2207 2.3005 4.9180 5.1110 4.0889 4.2172 11.6875 4.8814 7.1107 4.5828 3.8407 3.8894 3.4018 5.2491 4.9867 4.8574 7.4915 4.8260 3.0718 3.2605 5.9217 3.3181 5.4208 6.3768 7.3236 1.6214 6.7850 5.4444 5.6908 1.2650 2.8133 5.8855 1.3591 1.3691 5.8445 1.3307 1.3225 1.9010 2.1164 1.6336 1.6340 2.2941 2.0216 3.2985 3.8380 2.4090 1.3272 1.6550 1.7990 2.2368 1.9249 2.7335 1.2378 1.2646 2.5421 3.2036 5.9464 1.8850 1.0609 1.2253 1.0465 1.0472 4.2229 7.8941 5.8999 7.3537 9.6969 9.7972 1.0368 1.0368 1.0975 1.0975 1.1009 1.1010 1.0892 1.0890 1.0945 1.0949 1.0944 1.0944
irintensity: 2.3441 0.0002 7.4855 0.0000 0.0082 0.0002 2.5070 5.1722 0.0002 2.9876 0.0000 0.0002 15.6225 1.3325 0.0000 1.4246 0.0005 1.3934 0.0000 0.0001 0.0000 50.4537 0.9619 0.0000 0.0000 7.3896 0.5412 20.0289 0.0000 0.0000 2.6348 24.0081 0.0000 151.8673 0.0000 0.0001 2.2470 4.4894 106.0133 0.0001 6.5617 0.0014 408.0955 0.0224 18.9602 25.7133 0.0005 0.0003 1426.7440 0.0019 1.6355 0.0011 0.0000 4.4497 7.6560 60.7792 0.0237 94.7833 0.0000 99.3180 0.0000 0.0002 49.2631 0.1610 3.0929 35.8860 46.3862 0.0001 41.5589 0.0001 457.9605 0.0021 1.4681 0.9430 0.5384 12.6159 22.0476 0.2951 23.4622 0.0290 1.7800 15.3504 5.6428 0.0972
temp: 298.150 k
press: 1.00000 atm
elementType: 8 8 8 8 6 6 6 6 6 6 6 6 6 6 6 6 6 6 1 1 1 1 1 1 1 1 1 1 1 1
symmnumber: 1
zpe: 591068.3 jmol-1
zpe.correction: 0.225126 hartree
zpe.thermalcorrener: 0.241935 hartree
zpe.thermalcorrenthalpy: 0.242879 hartree
zpe.thermalcorrgfe: 0.178170 hartree
zpe.sumelectzpe: -840.327365 hartree
zpe.sumelectthermal: -840.310557 hartree
zpe.sumelectthermalent: -840.309613 hartree
zpe.sumelectthermalfe: -840.374321 hartree
dipole: -0.0009 0.0000 -0.0024
dipole: 0.0025
quadrupole: -97.0409 -96.0749 -106.2711
quadrupole: -23.2893 0.0480 0.0227
quadrupole: 2.7547 3.7207 -6.4754 -23.2893 0.0480 0.0227
hfenergy: -840.5524913 hartree
pointgroup: C01 [X(C14H12O4)]
dipole: 0.000339 -0.000045 0.0009424 debye
polarizability: 257.6290162|-11.8813719|193.3449965|-0.0615178|0.1637568|74.054657 unknown
InChI: InChI=1S/C14H12O4/c1-9(15)17-13-7-3-6-12-11(13)5-4-8-14(12)18-10(2)16/h3-8H,1-2H3
charge 0 multiplicity 1
30 atoms
O  -3.037353 -0.204827 0.018865
O  3.037351 0.204892 0.020664
O  -4.59242 1.5707 0.020444
O  4.591953 -1.570958 0.008409
C  -0.650047 -0.317501 0.019591
C  0.649999 0.317691 0.020359
C  -1.814209 0.532612 0.020328
C  1.814148 -0.532426 0.019567
C  -0.742586 -1.747139 0.018136
C  0.742549 1.747331 0.021826
C  -1.71523 1.926687 0.021951
C  1.715187 -1.926496 0.018292
C  0.416737 -2.522684 0.017589
C  -0.416773 2.522868 0.022672
C  -4.338043 0.350489 0.018471
C  4.337906 -0.35069 0.01439
C  -5.34466 -0.7786 0.014895
C  5.344811 0.778152 0.016036
H  -1.730946 -2.211849 0.017536
H  1.730913 2.212029 0.022387
H  -2.61049 2.547844 0.023078
H  2.610452 -2.547657 0.017904
H  0.344393 -3.615394 0.016537
H  -0.344435 3.61558 0.023865
H  -5.202071 -1.412592 -0.877303
H  -6.362314 -0.362895 0.017492
H  -5.200368 -1.420182 0.901332
H  5.200576 1.417988 -0.87171
H  6.362346 0.36215 0.013859
H  5.202524 1.413975 0.906939
