program: Orca
programVersion: 4.2.1
elementType: S O O O O O O O N N N N C C C C C C C C C C C C C C C H H H H H H H H H H H H H H H H H H
charge: 0
multiplicity: 1
keywords: wb97x-d3
keywords: def2-TZVPP
keywords: def2/J RIJCOSX GRIDX6 NOFINALGRIDX
keywords: grid4 nofinalgrid
keywords: scfconv7
keywords: smallprint printgap noloewdin
keywords: NOSOSCF
formula: C15H18N4O7S
InChI: InChI=1S/C15H18N4O7S/c1-4-25-10-7-5-6-8-11(10)26-27(21,22)19-15(20)18-14-16-12(23-2)9-13(17-14)24-3/h5-9,18-19H,4H2,1-3H3
45 atoms
S  1.08032 1.009203 -2.033454
O  1.657888 -0.434247 -2.445975
O  1.2403 -2.194483 -0.522546
O  2.177619 1.898921 -1.767391
O  0.109283 1.281491 -3.058836
O  -4.099369 1.214802 3.911657
O  -4.161724 1.010013 -0.722464
O  1.913646 0.605286 0.833123
N  0.200262 0.764064 -0.666388
N  -0.200449 0.654669 1.613112
N  -2.142604 0.916189 2.766079
N  -2.181747 0.820358 0.408055
C  2.764033 -0.970436 -1.785586
C  2.524024 -1.923622 -0.792838
C  4.038573 -0.605832 -2.160243
C  3.62159 -2.51027 -0.171875
C  5.1271 -1.195585 -1.529692
C  4.909593 -2.141614 -0.541828
C  0.93722 -3.075485 0.555543
C  0.72853 0.668205 0.600737
C  -1.572708 0.802457 1.581715
C  -0.562283 -3.196526 0.64844
C  -3.459035 1.078819 2.76366
C  -3.502742 0.980569 0.42217
C  -4.216254 1.120678 1.599043
C  -3.357842 1.195263 5.129699
C  -3.438235 0.874885 -1.943811
H  4.184637 0.12356 -2.945694
H  3.488493 -3.252222 0.603142
H  6.131615 -0.916682 -1.814876
H  5.749746 -2.608601 -0.045561
H  1.353759 -2.680099 1.487102
H  1.385285 -4.05771 0.377674
H  -0.830755 0.760484 -0.745045
H  0.203832 0.613657 2.539513
H  -0.817407 -3.857778 1.475621
H  -1.036061 -2.232702 0.835802
H  -0.987249 -3.619779 -0.261514
H  -5.287789 1.254871 1.611186
H  -2.869014 0.234661 5.287771
H  -2.613303 1.989573 5.161842
H  -4.087455 1.358348 5.917805
H  -4.185052 0.907307 -2.731949
H  -2.73924 1.698741 -2.089485
H  -2.91104 -0.077698 -1.997118
elementType: S O N C H
totalener: -1726.39051474 hartree
nucrepener: 2899.18748994 hartree
electener: -4625.57800468 hartree
oneelecener: -8131.29637453 hartree
twoeener: 3505.71836985 hartree
cpcmener: -0.04505441 hartree
kineticenergy: 1720.08673508 hartree
xcener: -141.531589621757 hartree
chargesum: 0.0000000
charge: 0.923542 -0.296802 -0.326956 -0.461675 -0.487199 -0.298849 -0.295609 -0.447539 -0.174663 -0.113581 -0.424944 -0.422267 0.135067 0.287500 -0.135935 -0.198511 -0.192734 -0.176732 0.027695 0.307235 0.362162 -0.266579 0.415490 0.423048 -0.314455 -0.114265 -0.128959 0.145897 0.148555 0.163938 0.163918 0.108422 0.117776 0.210978 0.196189 0.099552 0.067509 0.094285 0.147391 0.115175 0.114236 0.133045 0.140338 0.111209 0.118103
qa: 0.9235 -0.2968 -0.3270 -0.4617 -0.4872 -0.2988 -0.2956 -0.4475 -0.1747 -0.1136 -0.4249 -0.4223 0.1351 0.2875 -0.1359 -0.1985 -0.1927 -0.1767 0.0277 0.3072 0.3622 -0.2666 0.4155 0.4230 -0.3145 -0.1143 -0.1290 0.1459 0.1486 0.1639 0.1639 0.1084 0.1178 0.2110 0.1962 0.0996 0.0675 0.0943 0.1474 0.1152 0.1142 0.1330 0.1403 0.1112 0.1181
va: 6.0629 2.0616 2.0678 2.0156 2.0199 2.1239 2.1339 2.0553 3.0766 3.1698 2.9740 2.9612 3.7741 3.8723 3.9976 3.8728 3.9043 3.9325 3.7850 4.4443 4.2187 3.9736 4.0250 3.9856 3.9279 3.8452 3.8425 1.0045 1.0053 0.9874 0.9880 0.9895 0.9883 1.0757 1.0149 1.0065 1.0042 1.0043 1.0157 0.9953 0.9955 0.9932 0.9964 0.9955 0.9888
dispcorr: -0.025267043 hartree
energy: -1726.415781782056
dipole: -5.75132 3.86314 -1.88819 -13.83243 11.99373 -1.83870 12.01590 -9.30128 2.71462
magnitude: 3.78354 au
magnitude: 9.61700 debye
