program: Gaussian 09
title: 000069066
version: EM64L-G09RevD.01
frameworkgroup: C1[X(C14H11N)]
method: RPBEPBE
basis: SDD
operation: Freq
keyword: #pfreq=noraman
keyword: PBEPBE/SDD
title: #p freq=noraman PBEPBE/SDD
converged: NO YES NO YES
title: Mulliken charges:
elementType: N C C C C C C C C C C C C C C H H H H H H H H H H H
charge: -0.044316 0.242998 -0.246467 0.468705 0.427773 -0.442861 -0.474626 -0.390336 -0.319553 -0.428925 0.148640 -0.306824 -0.239988 -0.240415 -0.788012 0.230767 0.236337 0.286068 0.242915 0.238737 0.235376 0.229242 0.227490 0.227929 0.227916 0.251427
chargesum: 0.00000
title: Mulliken charges with hydrogens summed into heavy atoms:
elementType: N C C C C C C C C C C C C C C
charge: -0.044316 0.242998 -0.246467 0.468705 0.427773 -0.212094 -0.238289 -0.104268 -0.076637 -0.190188 0.148640 -0.071448 -0.010746 -0.012925 -0.080740
polarizability: 2.57236548e+02 -7.94130735e+00 1.75026064e+02 -7.15685242e-03 2.33203765e-04 6.45802266e+01
1716.lowfreq: 0.0004 0.0008 0.0009 5.3988 9.3237 15.4571 59.1307 89.6486 102.5953
frequency: 59.1232 89.6485 102.5928 180.0755 181.4730 245.2188 294.8221 330.8431 398.4559 418.5185 431.7734 447.0699 484.3792 511.6174 522.6973 573.4924 620.8962 623.7056 680.3743 703.1622 738.0282 760.3281 764.2500 816.2541 827.0695 865.3528 866.1719 883.4857 899.3669 967.3608 977.8232 979.6722 988.1974 1006.8830 1023.0634 1045.3780 1052.0135 1085.9924 1139.7960 1155.8024 1170.0227 1222.7522 1232.1383 1235.8418 1258.2908 1293.6384 1333.0489 1374.8668 1390.0215 1407.3129 1418.4430 1420.0144 1448.7407 1461.5231 1468.2735 1500.4675 1508.4342 1557.9037 1594.5115 1613.4466 1628.3667 2980.8848 3057.6454 3115.1427 3116.5106 3119.9957 3124.6831 3135.0803 3140.8222 3152.6664 3154.5357 3171.0095
redmass: 1.0508 3.3464 4.5464 3.8026 3.8593 4.7284 3.6592 3.3313 6.1266 3.3155 3.4029 5.3942 3.9481 3.2099 6.6343 3.2716 7.6393 3.2345 5.5805 6.3875 2.9234 5.6119 1.2674 1.3768 2.4641 1.8032 4.4645 5.1024 1.6729 1.3282 1.3699 1.7536 1.4038 1.3389 2.5123 1.5828 2.9119 2.1785 1.3081 1.2219 1.0884 1.9936 2.0925 1.8352 1.9746 2.4060 5.3695 3.4453 1.2987 3.1145 3.4437 2.5252 2.8080 1.2849 1.0466 3.2378 3.9029 6.8027 6.3507 6.6296 6.8849 1.0382 1.0971 1.0862 1.0980 1.0866 1.0882 1.0902 1.0980 1.0977 1.0958 1.0974
irintensity: 0.7052 0.0209 3.3329 5.8716 1.1383 0.4935 0.0117 5.0158 1.0182 0.3305 3.6458 0.7789 0.9953 3.4470 0.1278 10.5567 5.3941 2.9560 0.6705 0.5437 5.1767 1.4378 55.7793 7.6967 16.5831 76.3419 5.9766 0.3708 4.8753 0.3989 4.8218 8.5057 0.1247 0.6768 8.3969 8.6511 1.0928 5.1618 4.1927 7.8540 1.9105 8.7013 9.5130 0.5752 3.4140 0.0218 12.3643 7.5065 14.0604 3.1173 31.6648 9.7987 7.8829 28.5999 15.4007 13.6329 33.7711 5.2254 49.2129 1.6911 2.0468 26.4705 20.0112 1.4326 9.1719 1.8707 6.5605 12.9057 37.6792 31.5301 24.4734 19.3712
temp: 298.150 k
press: 1.00000 atm
elementType: 7 6 6 6 6 6 6 6 6 6 6 6 6 6 6 1 1 1 1 1 1 1 1 1 1 1
symmnumber: 1
zpe: 541604.9 jmol-1
zpe.correction: 0.206286 hartree
zpe.thermalcorrener: 0.217608 hartree
zpe.thermalcorrenthalpy: 0.218552 hartree
zpe.thermalcorrgfe: 0.168833 hartree
zpe.sumelectzpe: -593.855144 hartree
zpe.sumelectthermal: -593.843822 hartree
zpe.sumelectthermalent: -593.842878 hartree
zpe.sumelectthermalfe: -593.892597 hartree
dipole: -0.7970 1.4647 0.0002
dipole: 1.6675
quadrupole: -69.4802 -77.4934 -93.0144
quadrupole: -1.1022 -0.0012 0.0002
quadrupole: 10.5158 2.5026 -13.0184 -1.1022 -0.0012 0.0002
hfenergy: -594.0614301 hartree
pointgroup: C01 [X(C14H11N1)]
dipole: -0.3344741 0.5643825 0.0000611 debye
dipolederiv: -0.6355418 -0.1366307 0.00002 -0.0563825 -0.323356 -0.0000029 0.000016 0.0000056 -0.2317313 -0.0638698 -0.0769375 0.0000024 -0.0959016 -0.0184343 0.0000013 -0.0000099 0.0000005 -0.0007349 0.5124357 0.0592354 -0.0000173 -0.171218 0.0666115 0.0000081 -0.0000068 -0.000001 0.0274479 -0.1958893 0.0762397 0.0000154 0.3151038 -0.1897963 -0.0000116 0.0000226 -0.0000049 0.0827826 0.0894477 -0.1439597 -0.0000006 -0.1355756 -0.0516988 0.0000044 -0.0000034 0.0000012 0.0494186 -0.0430919 -0.0142064 -0.0000071 0.09925 0.1203095 0.0000034 -0.0000071 0.000009 -0.1844845 -0.0324729 0.0699982 -0.0000029 -0.0307669 0.1320041 0.0000026 0.0000067 0.0000013 -0.1699779 -0.0971057 0.1223986 0.0000051 0.0390506 -0.0059097 0.0000006 0.0000008 0.0000054 -0.1296271 0.2996655 -0.033791 -0.0000197 -0.0395803 0.1966245 0.000006 -0.0000164 0.0000134 -0.1413077 -0.0147498 0.110909 -0.0000047 0.2127743 0.0090875 -0.000005 -0.0000049 -0.0000026 -0.1809255 0.4130835 0.2278584 -0.0000286 0.5042593 0.5244139 -0.000036 -0.0000904 -0.0000666 0.0346944 -0.0796386 -0.0384567 -0.0000202 -0.4092472 -0.3289397 0.0000189 -0.0000254 0.0000142 -0.1543352 -0.0668056 -0.0817804 -0.0000061 -0.0163248 0.122179 0.0000051 -0.0000123 0.0000111 -0.1676838 0.1107867 0.0030932 -0.0000046 -0.0271966 -0.0294236 0.0000009 0.0000054 -0.0000029 -0.1538271 -0.2030643 -0.1869714 0.0000305 -0.158163 -0.1171561 0.0000061 0.0001483 0.000081 0.0551235 0.0398868 0.1014032 0.0000067 0.0221365 -0.1042573 -0.0000051 0.0000025 -0.0000082 0.156519 -0.0181591 -0.1321525 0.0000046 -0.0601912 -0.0291315 0.000001 -0.0000007 -0.0000008 0.1540651 0.0991059 -0.0926094 -0.0000025 -0.0477254 0.0263973 -0.0000005 -0.0000021 -0.0000018 0.1506484 0.0684 0.0244652 0.0000033 0.0886699 -0.0961325 -0.0000077 0.0000061 -0.0000101 0.1431408 -0.001974 -0.0627106 0.0000043 -0.1355737 -0.0456353 0.0000019 0.0000071 0.0000012 0.1565118 -0.1357464 0.0256336 0.0000175 0.0215459 0.0998931 -0.0000021 0.0000178 -0.0000054 0.1587812 0.0439932 0.0697644 0.0000048 0.096712 -0.1075957 -0.0000058 0.0000123 -0.0000112 0.1582429 -0.1513435 0.0460417 0.0000085 0.0456087 0.0847344 -0.0000015 -0.0000027 0.000002 0.1597532 -0.0019448 -0.0375927 0.10724 -0.0408968 0.0544922 -0.033292 0.1417002 0.0227921 -0.0438566 -0.0020731 -0.0375573 -0.107294 -0.0407905 0.0544915 0.0333558 -0.1417616 -0.0227529 -0.0437206 0.0666655 0.1383155 0.0000454 0.020423 -0.0437718 -0.000046 -0.0000022 -0.0000694 0.1150827 unknown
polarizability: 257.7081678|-4.9061056|174.554444|-0.0071606|-0.0000295|64.5802266 unknown
InChI: InChI=1S/C14H11N/c1-10-6-7-12-9-8-11-4-2-3-5-13(11)14(12)15-10/h2-9H,1H3
charge 0 multiplicity 1
26 atoms
N  -1.412726 -1.129115 0.000077
C  0.895857 -0.334789 0.000007
C  -0.538687 -0.059066 0.000038
C  -0.995895 1.307502 0.000079
C  1.823861 0.768546 -0.000005
C  -0.036261 2.386592 0.000063
C  1.321817 2.125451 0.000002
C  1.397779 -1.669457 -0.000008
C  -2.407144 1.528655 0.000134
C  3.227273 0.495304 -0.000037
C  -2.747615 -0.892991 0.000131
C  -3.280974 0.438044 0.000168
C  2.77826 -1.911903 -0.000034
C  3.700167 -0.823141 -0.000074
C  -3.668483 -2.096029 0.000202
H  -0.406209 3.419223 0.000099
H  2.045432 2.949469 -0.000014
H  0.670539 -2.486275 -0.000015
H  -2.791743 2.555475 0.000173
H  3.931061 1.336488 -0.00005
H  -4.366368 0.583773 0.000239
H  3.153221 -2.941357 -0.000058
H  4.7780 -1.020351 -0.000103
H  -4.325538 -2.097696 0.890434
H  -4.326075 -2.097394 -0.889631
H  -3.069547 -3.019559 -0.000119
