program: Orca
programVersion: 4.2.1
elementType: S O O O O O O O N N N N C C C C C C C C C C C C C C C H H H H H H H H H H H H H H H H H H
charge: 0
multiplicity: 1
keywords: wb97x-d3
keywords: def2-TZVPP
keywords: def2/J RIJCOSX GRIDX6 NOFINALGRIDX
keywords: grid4 nofinalgrid
keywords: scfconv7
keywords: smallprint printgap noloewdin
keywords: NOSOSCF
formula: C15H18N4O7S
InChI: InChI=1S/C15H18N4O7S/c1-4-25-10-7-5-6-8-11(10)26-27(21,22)19-15(20)18-14-16-12(23-2)9-13(17-14)24-3/h5-9,18-19H,4H2,1-3H3
45 atoms
S  1.941959 1.846567 -0.482693
O  2.733708 0.461759 -0.226477
O  1.004355 -1.540996 -0.179963
O  2.242101 2.61384 0.694167
O  2.230737 2.317257 -1.806923
O  -1.535351 1.541534 3.583338
O  -5.094891 -0.855364 1.814095
O  -0.028699 0.613819 -2.442867
N  0.351715 1.453988 -0.347464
N  -1.624207 0.365327 -0.870917
N  -1.555943 0.975537 1.371252
N  -3.363852 -0.235228 0.464358
C  2.802398 -0.49899 -1.227813
C  1.910962 -1.57466 -1.168515
C  3.771698 -0.406181 -2.204349
C  2.019029 -2.564744 -2.139673
C  3.870357 -1.401701 -3.166314
C  2.990859 -2.470847 -3.127659
C  0.124366 -2.644574 0.012971
C  -0.391616 0.798483 -1.307306
C  -2.199893 0.380191 0.381182
C  0.797931 -3.830872 0.667163
C  -2.139473 0.958936 2.566485
C  -3.933906 -0.248122 1.661166
C  -3.362735 0.347279 2.780619
C  -0.270841 2.165669 3.372144
C  -5.689347 -1.499219 0.690409
H  4.45426 0.433567 -2.20648
H  1.352609 -3.416002 -2.14437
H  4.628021 -1.337966 -3.934912
H  3.055787 -3.253589 -3.871883
H  -0.359766 -2.922096 -0.927895
H  -0.656641 -2.265094 0.670559
H  -0.060024 1.478521 0.602151
H  -2.17361 -0.095456 -1.584903
H  0.052043 -4.605685 0.849026
H  1.583942 -4.269899 0.052681
H  1.230577 -3.552624 1.628532
H  -3.837454 0.329181 3.750735
H  0.013786 2.585255 4.333303
H  0.487939 1.443554 3.067697
H  -0.335193 2.9723 2.641245
H  -5.906357 -0.794229 -0.111993
H  -5.058163 -2.299966 0.304214
H  -6.620768 -1.923871 1.055656
elementType: S O N C H
totalener: -1726.39088288 hartree
nucrepener: 2931.86652558 hartree
electener: -4658.25740846 hartree
oneelecener: -8196.19329277 hartree
twoeener: 3537.93588432 hartree
cpcmener: -0.03852135 hartree
kineticenergy: 1720.11134268 hartree
xcener: -141.535185046452 hartree
chargesum: -0.0000000
charge: 0.916839 -0.299344 -0.326392 -0.478084 -0.447533 -0.287010 -0.289718 -0.413505 -0.177746 -0.124593 -0.411034 -0.416054 0.117878 0.287979 -0.123997 -0.178883 -0.184947 -0.183530 0.019401 0.292928 0.332081 -0.253022 0.420385 0.413355 -0.316231 -0.128542 -0.116534 0.143282 0.143283 0.159488 0.159981 0.098221 0.103961 0.201548 0.191685 0.098333 0.091849 0.092066 0.145327 0.138610 0.111363 0.117228 0.113912 0.113676 0.132044
qa: 0.9168 -0.2993 -0.3264 -0.4781 -0.4475 -0.2870 -0.2897 -0.4135 -0.1777 -0.1246 -0.4110 -0.4161 0.1179 0.2880 -0.1240 -0.1789 -0.1849 -0.1835 0.0194 0.2929 0.3321 -0.2530 0.4204 0.4134 -0.3162 -0.1285 -0.1165 0.1433 0.1433 0.1595 0.1600 0.0982 0.1040 0.2015 0.1917 0.0983 0.0918 0.0921 0.1453 0.1386 0.1114 0.1172 0.1139 0.1137 0.1320
va: 6.0722 2.0558 2.0745 2.0288 2.0402 2.1446 2.1341 2.0947 3.0805 3.1713 2.9683 2.9476 3.8117 3.8566 4.0086 3.8520 3.9114 3.9433 3.8610 4.4747 4.2455 3.9428 3.9865 4.0239 3.9280 3.8429 3.8495 1.0047 1.0051 0.9887 0.9897 0.9920 0.9906 1.0906 1.0170 1.0072 1.0033 1.0044 1.0165 0.9963 0.9948 0.9913 0.9957 0.9956 0.9934
dispcorr: -0.026105155 hartree
energy: -1726.416988033421
dipole: -7.53098 4.91218 -2.61879 -20.37579 17.60437 -2.77142 4.21812 -3.00502 1.21310
magnitude: 4.00131 au
magnitude: 10.17051 debye
