program: Orca
programVersion: 4.2.1
elementType: S O O O O O O O N N N N C C C C C C C C C C C C C C C H H H H H H H H H H H H H H H H H H
charge: 0
multiplicity: 1
keywords: wb97x-d3
keywords: def2-TZVPP
keywords: def2/J RIJCOSX GRIDX6 NOFINALGRIDX
keywords: grid4 nofinalgrid
keywords: scfconv7
keywords: smallprint printgap noloewdin
keywords: NOSOSCF
formula: C15H18N4O7S
InChI: InChI=1S/C15H18N4O7S/c1-4-25-10-7-5-6-8-11(10)26-27(21,22)19-15(20)18-14-16-12(23-2)9-13(17-14)24-3/h5-9,18-19H,4H2,1-3H3
45 atoms
S  1.944744 1.851497 -0.480722
O  2.728356 0.462928 -0.219162
O  0.983454 -1.527355 -0.187371
O  2.244891 2.618781 0.696164
O  2.240417 2.318205 -1.804856
O  -1.518958 1.509734 3.587623
O  -5.084064 -0.869496 1.806483
O  -0.030279 0.63874 -2.450906
N  0.352247 1.466798 -0.350666
N  -1.625121 0.383502 -0.879263
N  -1.548814 0.969453 1.369164
N  -3.358851 -0.233659 0.456504
C  2.798345 -0.498747 -1.219395
C  1.898763 -1.568014 -1.16759
C  3.77748 -0.413698 -2.186844
C  2.008994 -2.559786 -2.13686
C  3.878732 -1.411201 -3.146448
C  2.991372 -2.474114 -3.115105
C  0.097435 -2.626965 0.001412
C  -0.392036 0.81718 -1.313986
C  -2.196056 0.384265 0.375144
C  0.762043 -3.815264 0.661124
C  -2.127045 0.938535 2.566668
C  -3.924081 -0.25992 1.655403
C  -3.348786 0.323332 2.779092
C  -0.255896 2.137428 3.378447
C  -5.682765 -1.501541 0.67839
H  4.465803 0.421345 -2.183198
H  1.335886 -3.405716 -2.147563
H  4.64448 -1.353893 -3.907502
H  3.058313 -3.258376 -3.857559
H  -0.381528 -2.903532 -0.942321
H  -0.685933 -2.243135 0.653805
H  -0.058814 1.483171 0.599641
H  -2.17626 -0.071369 -1.595737
H  0.012068 -4.587175 0.838488
H  1.550564 -4.257605 0.052282
H  1.189315 -3.537895 1.625145
H  -3.819473 0.294167 3.750906
H  0.502466 1.419344 3.06356
H  -0.323712 2.951863 2.656572
H  0.031909 2.54696 4.342999
H  -5.905873 -0.787595 -0.114378
H  -5.051466 -2.295846 0.279343
H  -6.611143 -1.932952 1.043497
elementType: S O N C H
totalener: -1726.39091049 hartree
nucrepener: 2933.87727295 hartree
electener: -4660.26818344 hartree
oneelecener: -8200.19765702 hartree
twoeener: 3539.92947358 hartree
cpcmener: -0.03870269 hartree
kineticenergy: 1720.11092656 hartree
xcener: -141.535160567198 hartree
chargesum: 0.0000000
charge: 0.917506 -0.299433 -0.326310 -0.478946 -0.447431 -0.286931 -0.289743 -0.413247 -0.177829 -0.124885 -0.409828 -0.415500 0.116424 0.288203 -0.123424 -0.179580 -0.185136 -0.182113 0.019070 0.293205 0.329107 -0.253157 0.420937 0.413658 -0.316307 -0.128892 -0.116612 0.143600 0.143809 0.159431 0.160054 0.099215 0.103298 0.201337 0.191677 0.098395 0.091912 0.092018 0.145376 0.111248 0.117515 0.138612 0.113989 0.113607 0.132102
qa: 0.9175 -0.2994 -0.3263 -0.4789 -0.4474 -0.2869 -0.2897 -0.4132 -0.1778 -0.1249 -0.4098 -0.4155 0.1164 0.2882 -0.1234 -0.1796 -0.1851 -0.1821 0.0191 0.2932 0.3291 -0.2532 0.4209 0.4137 -0.3163 -0.1289 -0.1166 0.1436 0.1438 0.1594 0.1601 0.0992 0.1033 0.2013 0.1917 0.0984 0.0919 0.0920 0.1454 0.1112 0.1175 0.1386 0.1140 0.1136 0.1321
va: 6.0713 2.0555 2.0744 2.0276 2.0407 2.1445 2.1342 2.0949 3.0812 3.1710 2.9682 2.9464 3.8131 3.8570 4.0082 3.8519 3.9116 3.9410 3.8614 4.4753 4.2482 3.9432 3.9855 4.0230 3.9286 3.8431 3.8496 1.0045 1.0049 0.9887 0.9896 0.9915 0.9907 1.0911 1.0169 1.0072 1.0033 1.0044 1.0165 0.9949 0.9911 0.9964 0.9956 0.9956 0.9934
dispcorr: -0.026180894 hartree
energy: -1726.417091385674
dipole: -7.60951 4.98468 -2.62483 -20.39968 17.61330 -2.78638 4.20954 -2.99831 1.21124
magnitude: 4.01507 au
magnitude: 10.20549 debye
