program: Gaussian 09
title: 000069065
version: EM64L-G09RevD.01
frameworkgroup: C1[X(C12H8O4)]
method: RPBEPBE
basis: SDD
operation: Freq
keyword: #pfreq=noraman
keyword: PBEPBE/SDD
title: #p freq=noraman PBEPBE/SDD
converged: YES YES NO NO
title: Mulliken charges:
elementType: O O O O C C C C C C C C C C C C H H H H H H H H
charge: -0.442634 -0.442627 -0.256658 -0.256655 0.246687 0.246668 0.090533 0.090478 -0.388894 -0.388872 -0.342803 -0.342776 -0.246285 -0.246319 0.122245 0.122262 0.306895 0.306899 0.288316 0.288319 0.234210 0.234213 0.388399 0.388395
chargesum: 0.00000
title: Mulliken charges with hydrogens summed into heavy atoms:
elementType: O O O O C C C C C C C C C C C C
charge: -0.054235 -0.054232 -0.256658 -0.256655 0.246687 0.246668 0.090533 0.090478 -0.081998 -0.081972 -0.054487 -0.054457 -0.012074 -0.012106 0.122245 0.122262
polarizability: 2.05649477e+02 -2.00847847e-03 1.92607234e+02 -4.56732027e-03 7.60742348e-03 5.48872086e+01
1716.lowfreq: -10.5253 -6.2776 -6.0066 -0.0005 -0.0004 0.0005 26.5839 28.3901 69.3902
frequency: 26.5827 28.2250 69.3901 107.6850 183.3941 186.5979 231.5196 264.2451 296.1084 327.9969 391.6293 397.1132 415.0906 463.9575 515.5904 538.8400 561.2324 569.6448 571.7701 595.6230 610.7731 639.4551 687.1298 690.1341 719.4370 725.6773 788.8271 795.6516 804.8272 888.4750 905.0806 908.6900 965.7053 1002.7013 1006.0100 1017.9054 1042.7579 1055.8891 1071.8895 1159.1555 1161.7243 1187.0230 1196.4671 1212.3777 1284.1183 1306.7040 1311.3194 1364.2037 1387.2926 1398.2384 1443.5601 1452.7005 1523.2677 1563.4144 1589.5879 1619.6263 1630.6586 1632.1800 3134.3703 3154.9666 3179.8868 3188.0899 3191.3067 3197.2103 3529.2518 3529.5729
redmass: 11.5537 11.8219 6.2667 4.1279 7.8906 4.2865 6.0766 5.2294 11.9788 7.6948 8.9414 3.3922 6.8056 3.1045 2.8128 6.1968 7.8303 1.4341 5.3246 4.6503 1.3718 2.3536 5.3650 5.1220 2.8349 7.1854 5.4207 1.4652 4.7167 1.4777 7.9435 1.4488 7.4065 1.3469 1.4067 1.3112 2.6036 3.1843 2.1671 1.5789 2.1434 1.1203 1.7886 1.6719 1.5745 2.4911 2.0903 5.4785 2.0998 7.6802 2.4498 2.5459 4.1922 6.1136 7.4592 5.5656 8.0625 8.5328 1.0874 1.0943 1.0892 1.0938 1.0960 1.0960 1.0641 1.0642
irintensity: 0.0068 2.4143 0.0474 0.0000 0.1094 5.6632 4.1942 0.0000 0.8543 0.9302 11.1526 17.1583 6.4892 0.0001 13.1509 32.7762 3.0588 0.0198 2.4722 50.6832 302.1505 0.0015 1.2164 50.4805 14.2278 0.0007 0.4983 121.2464 0.0000 24.3827 90.3400 0.0000 133.9429 6.4003 0.0012 0.0008 2.4494 304.3530 419.8190 58.3244 28.6712 4.0660 19.2070 4.4309 26.5350 31.5609 115.2584 2.0540 10.1722 5.9865 5.7739 22.9752 59.9906 69.3150 19.7869 71.4908 150.4249 210.1217 12.4116 20.0171 0.0068 7.3219 20.7898 0.1893 97.9494 28.6674
temp: 298.150 k
press: 1.00000 atm
elementType: 8 8 8 8 6 6 6 6 6 6 6 6 6 6 6 6 1 1 1 1 1 1 1 1
symmnumber: 1
zpe: 452173.6 jmol-1
zpe.correction: 0.172224 hartree
zpe.thermalcorrener: 0.185137 hartree
zpe.thermalcorrenthalpy: 0.186081 hartree
zpe.thermalcorrgfe: 0.131096 hartree
zpe.sumelectzpe: -761.896958 hartree
zpe.sumelectthermal: -761.884046 hartree
zpe.sumelectthermalent: -761.883101 hartree
zpe.sumelectthermalfe: -761.938087 hartree
dipole: -0.0004 -1.6388 -0.0068
dipole: 1.6388
quadrupole: -85.8170 -79.1067 -94.2592
quadrupole: 0.0002 0.0597 -0.0325
quadrupole: 0.5773 7.2876 -7.8649 0.0002 0.0597 -0.0325
hfenergy: -762.0691822 hartree
pointgroup: C01 [X(C12H8O4)]
dipole: -0.0003894 0.6447385 0.0027523 debye
dipolederiv: -0.6724977 -0.4936989 -0.0162596 -0.6856878 -1.1159909 -0.0446466 -0.0164456 -0.0321938 -0.4256205 -0.6729524 0.4938955 -0.0136457 0.6859413 -1.1159387 0.0410314 -0.0115193 0.0280866 -0.4251322 -1.0625145 0.1697981 -0.0484853 0.1382502 -0.7191316 0.0091372 -0.0485167 0.0110384 -0.3242374 -1.0622492 -0.1696114 -0.0510331 -0.1380903 -0.7191413 -0.0121827 -0.0497878 -0.0138596 -0.3244982 -0.1230697 -0.3385216 -0.0093145 0.1934705 0.0752196 0.0126035 -0.0095039 -0.0221072 0.0212106 -0.1230018 0.3385526 -0.0095316 -0.1934533 0.0751429 -0.0128082 -0.0101682 0.0219224 0.0211453 -0.7571705 -0.1021712 -0.0505302 -0.0434872 0.1879867 -0.0028346 -0.0502122 -0.0065675 0.014306 -0.7571382 0.1021449 -0.0507295 0.0435126 0.1880361 0.0021235 -0.0507551 0.0060531 0.0142514 0.0158196 -0.0509798 0.0100843 -0.099426 -0.1556834 -0.0065363 0.0099251 -0.003335 -0.1395075 0.0157821 0.0509477 0.0099531 0.0993877 -0.1556543 0.0065116 0.0100689 0.0037144 -0.1394955 0.0522289 0.3551276 0.01078 0.0126232 -0.1722456 0.0006305 0.0105676 0.0226356 -0.115819 0.0521031 -0.3551349 0.0109389 -0.0126499 -0.1722765 -0.000533 0.0116933 -0.0224945 -0.1157349 0.0854476 -0.1844615 0.0149352 -0.1368344 0.0703764 -0.008783 0.0149177 -0.0115445 -0.1424954 0.0854345 0.1845002 0.0147932 0.1368701 0.0703641 0.0085606 0.0149149 0.0114807 -0.142514 2.0483059 0.3240714 0.118813 0.3613631 1.3997094 0.0234317 0.1188877 0.0211197 0.2382122 2.0483254 -0.3244571 0.1197847 -0.3618098 1.3996568 -0.0153814 0.1176065 -0.0137406 0.2382399 0.0763533 0.0728211 -0.0057103 0.0069106 0.1516245 0.0004673 -0.0055662 0.0046933 0.164441 0.0764042 -0.0728342 -0.0055289 -0.0069349 0.1516635 -0.0004488 -0.0055684 -0.0049741 0.1644517 0.1043831 -0.0304491 -0.0033635 -0.0544744 0.0249743 -0.0034438 -0.0033327 -0.0017664 0.156707 0.1044048 0.0304461 -0.0034365 0.0544684 0.02498 0.0035696 -0.0035891 0.0018528 0.1566846 0.038772 0.0985361 -0.0075315 0.0880605 -0.0786677 0.0057527 -0.0075413 0.0062884 0.1543649 0.0387534 -0.0985517 -0.0074628 -0.0880749 -0.0786553 -0.0055159 -0.007442 -0.0061627 0.1543766 0.1939576 0.0790219 -0.0133494 0.1751646 0.3318258 0.0113981 -0.0132297 0.005202 0.3984337 0.1941183 -0.0789919 -0.0141699 -0.1750998 0.331825 -0.0121033 -0.0154036 -0.0053414 0.3982296 unknown
polarizability: 205.0078692|0.0009683|192.6072298|9.8142009|0.027369|55.528821 unknown
InChI: InChI=1S/C12H8O4/c13-11(14)9-5-6-10(12(15)16)8-4-2-1-3-7(8)9/h1-6,13,15H
charge 0 multiplicity 1
24 atoms
O  3.367042 2.047037 0.219237
O  -3.367338 2.046866 -0.213592
O  3.757058 -0.224561 0.244956
O  -3.756387 -0.224753 -0.253778
C  0.729277 -0.649618 0.047404
C  -0.729177 -0.649628 -0.047999
C  1.431244 0.620083 0.092737
C  -1.431139 0.620025 -0.093711
C  1.415283 -1.911148 0.092356
C  -1.415307 -1.911102 -0.092022
C  0.705146 1.823357 0.045246
C  -0.705094 1.823332 -0.046346
C  0.711316 -3.115247 0.046989
C  -0.711478 -3.115229 -0.045512
C  2.920367 0.711874 0.190244
C  -2.920212 0.711715 -0.192091
H  2.50403 -1.909424 0.16263
H  -2.504023 -1.909325 -0.162933
H  1.247364 2.770286 0.079612
H  -1.247343 2.770234 -0.080934
H  1.256934 -4.064499 0.082399
H  -1.257198 -4.064455 -0.08007
H  4.359611 2.037768 0.283667
H  -4.359777 2.037612 -0.279889
