program: Orca
programVersion: 4.2.1
elementType: S O O O O O O O N N N N C C C C C C C C C C C C C C C H H H H H H H H H H H H H H H H H H
charge: 0
multiplicity: 1
keywords: wb97x-d3
keywords: def2-TZVPP
keywords: def2/J RIJCOSX GRIDX6 NOFINALGRIDX
keywords: grid4 nofinalgrid
keywords: scfconv7
keywords: smallprint printgap noloewdin
keywords: NOSOSCF
formula: C15H18N4O7S
InChI: InChI=1S/C15H18N4O7S/c1-4-25-10-7-5-6-8-11(10)26-27(21,22)19-15(20)18-14-16-12(23-2)9-13(17-14)24-3/h5-9,18-19H,4H2,1-3H3
45 atoms
S  2.03714 1.479299 0.214447
O  2.551144 0.8419 -1.168908
O  1.093754 -1.197286 -1.991226
O  2.941946 1.115197 1.269252
O  1.771251 2.849463 -0.130225
O  -3.099203 3.140957 -0.108862
O  -5.481877 -0.306682 1.884946
O  1.207942 -1.231841 1.25191
N  0.556543 0.813711 0.475513
N  -0.985995 -0.710101 1.286854
N  -2.023047 1.244608 0.572125
N  -3.229354 -0.50976 1.585853
C  3.138529 -0.417553 -1.204662
C  2.364394 -1.481105 -1.678097
C  4.465593 -0.570218 -0.864091
C  2.978427 -2.724126 -1.803271
C  5.062703 -1.817603 -0.98529
C  4.313522 -2.883429 -1.454402
C  0.272099 -2.197406 -2.586402
C  0.335511 -0.430812 1.019819
C  -2.124165 0.053798 1.13837
C  -0.341785 -3.140684 -1.575992
C  -3.146679 1.945592 0.446163
C  -4.342106 0.198403 1.453304
C  -4.370597 1.463805 0.877999
C  -1.842913 3.654311 -0.544288
C  -5.477679 -1.594509 2.495244
H  5.036224 0.283269 -0.522479
H  2.431934 -3.581945 -2.169581
H  6.102264 -1.947401 -0.718489
H  4.766419 -3.860728 -1.557533
H  0.829172 -2.742738 -3.353714
H  -0.512704 -1.643322 -3.101066
H  -0.275932 1.389826 0.268609
H  -1.136934 -1.617586 1.708206
H  -0.952362 -3.875415 -2.102738
H  0.400951 -3.685908 -0.993894
H  -0.993619 -2.609564 -0.883029
H  -5.282539 2.033891 0.776938
H  -1.146032 3.772622 0.286304
H  -1.397976 3.029604 -1.31975
H  -2.055982 4.633784 -0.963999
H  -6.510234 -1.789948 2.772559
H  -5.139137 -2.367549 1.805308
H  -4.856215 -1.615084 3.390621
elementType: S O N C H
totalener: -1726.39217713 hartree
nucrepener: 2889.51738962 hartree
electener: -4615.90956675 hartree
oneelecener: -8111.83394506 hartree
twoeener: 3495.92437832 hartree
cpcmener: -0.03735501 hartree
kineticenergy: 1720.10797084 hartree
xcener: -141.534989430064 hartree
chargesum: 0.0000000
charge: 0.914964 -0.294858 -0.321366 -0.450582 -0.479969 -0.288094 -0.290140 -0.422014 -0.181898 -0.138799 -0.430579 -0.427709 0.124035 0.295344 -0.125242 -0.190503 -0.187557 -0.190444 0.021800 0.308337 0.384111 -0.262555 0.417939 0.409212 -0.316657 -0.131535 -0.116601 0.141436 0.143276 0.159004 0.159325 0.098100 0.113125 0.210396 0.196182 0.107006 0.091253 0.078549 0.145098 0.113899 0.116900 0.138152 0.132332 0.113309 0.114019
qa: 0.9150 -0.2949 -0.3214 -0.4506 -0.4800 -0.2881 -0.2901 -0.4220 -0.1819 -0.1388 -0.4306 -0.4277 0.1240 0.2953 -0.1252 -0.1905 -0.1876 -0.1904 0.0218 0.3083 0.3841 -0.2626 0.4179 0.4092 -0.3167 -0.1315 -0.1166 0.1414 0.1433 0.1590 0.1593 0.0981 0.1131 0.2104 0.1962 0.1070 0.0913 0.0785 0.1451 0.1139 0.1169 0.1382 0.1323 0.1133 0.1140
va: 6.0771 2.0650 2.0769 2.0295 2.0292 2.1427 2.1329 2.0858 3.0781 3.1747 2.9833 2.9621 3.7987 3.8789 4.0039 3.8626 3.9131 3.9513 3.8552 4.4540 4.2122 3.9061 3.9954 4.0342 3.9271 3.8438 3.8486 1.0064 1.0031 0.9892 0.9900 0.9965 0.9930 1.0752 1.0128 1.0108 1.0062 1.0120 1.0163 0.9948 0.9899 0.9966 0.9932 0.9956 0.9958
dispcorr: -0.025021279 hartree
energy: -1726.417198410192
dipole: -10.36898 7.39219 -2.97679 -15.44494 13.64949 -1.79545 -6.57227 5.72151 -0.85076
magnitude: 3.57892 au
magnitude: 9.09690 debye
