program: Orca
programVersion: 4.2.1
elementType: S O O O O O O O N N N N C C C C C C C C C C C C C C C H H H H H H H H H H H H H H H H H H
charge: 0
multiplicity: 1
keywords: wb97x-d3
keywords: def2-TZVPP
keywords: def2/J RIJCOSX GRIDX6 NOFINALGRIDX
keywords: grid4 nofinalgrid
keywords: scfconv7
keywords: smallprint printgap noloewdin
keywords: NOSOSCF
formula: C15H18N4O7S
InChI: InChI=1S/C15H18N4O7S/c1-4-25-10-7-5-6-8-11(10)26-27(21,22)19-15(20)18-14-16-12(23-2)9-13(17-14)24-3/h5-9,18-19H,4H2,1-3H3
45 atoms
S  2.197254 1.75678 -0.28009
O  2.889813 0.297483 -0.349367
O  1.095229 -1.632716 -0.037505
O  2.56607 2.234258 1.024204
O  2.507924 2.48367 -1.478336
O  -1.284136 0.878813 3.688949
O  -4.980397 -0.918115 1.531038
O  0.088733 1.218079 -2.434612
N  0.588037 1.438194 -0.206773
N  -1.474294 0.661188 -0.9105
N  -1.351885 0.782046 1.408199
N  -3.231445 -0.116384 0.305428
C  2.601057 -0.520471 -1.435399
C  1.658786 -1.5380 -1.250593
C  3.259614 -0.344403 -2.634657
C  1.373628 -2.365906 -2.332886
C  2.97419 -1.184769 -3.701252
C  2.026997 -2.182774 -3.544469
C  0.266581 -2.758576 0.237172
C  -0.228287 1.122384 -1.27518
C  -2.036019 0.440966 0.328395
C  -0.044815 -2.773937 1.711708
C  -1.929023 0.553972 2.585371
C  -3.792216 -0.347828 1.484387
C  -3.182705 -0.023068 2.691994
C  0.01891 1.448783 3.588293
C  -5.609981 -1.302284 0.311278
H  3.999734 0.438259 -2.733034
H  0.642402 -3.15769 -2.247401
H  3.487612 -1.054333 -4.643859
H  1.788977 -2.839029 -4.371217
H  0.783407 -3.681952 -0.042658
H  -0.653123 -2.703808 -0.354043
H  0.181911 1.279166 0.732898
H  -2.065668 0.415945 -1.694301
H  -0.697408 -3.619311 1.929855
H  0.85908 -2.884289 2.310933
H  -0.560447 -1.869378 2.03151
H  -3.649665 -0.216354 3.646537
H  0.006591 2.392255 3.041886
H  0.336111 1.638106 4.61027
H  0.72658 0.758611 3.126376
H  -5.808433 -0.443351 -0.329724
H  -5.012693 -2.030393 -0.237749
H  -6.55289 -1.758633 0.600756
elementType: S O N C H
totalener: -1726.39162856 hartree
nucrepener: 2969.84665787 hartree
electener: -4696.23828643 hartree
oneelecener: -8271.95340355 hartree
twoeener: 3575.71511712 hartree
cpcmener: -0.03805973 hartree
kineticenergy: 1720.10580360 hartree
xcener: -141.532802888400 hartree
chargesum: -0.0000000
charge: 0.916301 -0.296656 -0.312780 -0.477375 -0.448516 -0.284294 -0.288698 -0.409222 -0.186079 -0.120695 -0.402869 -0.413548 0.082276 0.300524 -0.110592 -0.181438 -0.188458 -0.178734 0.020446 0.298167 0.338767 -0.277096 0.377269 0.411588 -0.294694 -0.119869 -0.117372 0.141876 0.145560 0.159938 0.160531 0.119830 0.100159 0.200628 0.192564 0.102059 0.098924 0.073980 0.145113 0.118127 0.139072 0.104199 0.114472 0.113926 0.132687
qa: 0.9163 -0.2967 -0.3128 -0.4774 -0.4485 -0.2843 -0.2887 -0.4092 -0.1861 -0.1207 -0.4029 -0.4135 0.0823 0.3005 -0.1106 -0.1814 -0.1885 -0.1787 0.0204 0.2982 0.3388 -0.2771 0.3773 0.4116 -0.2947 -0.1199 -0.1174 0.1419 0.1456 0.1599 0.1605 0.1198 0.1002 0.2006 0.1926 0.1021 0.0989 0.0740 0.1451 0.1181 0.1391 0.1042 0.1145 0.1139 0.1327
va: 6.0680 2.0558 2.0777 2.0280 2.0404 2.1346 2.1364 2.1016 3.0753 3.1757 2.9470 2.9469 3.7892 3.8506 3.9875 3.8637 3.9252 3.9496 3.7954 4.4533 4.2419 3.9814 3.9923 4.0262 3.9208 3.8426 3.8491 1.0067 1.0062 0.9884 0.9893 0.9898 0.9850 1.0936 1.0170 1.0061 1.0059 0.9914 1.0165 0.9912 0.9964 0.9946 0.9953 0.9954 0.9932
dispcorr: -0.027749100 hartree
energy: -1726.419377660071
dipole: -11.31185 8.32735 -2.98449 -18.41160 15.54724 -2.86436 5.21112 -4.31645 0.89467
magnitude: 4.23228 au
magnitude: 10.75761 debye
