program: Gaussian 09
title: 000074131
version: EM64L-G09RevD.01
frameworkgroup: C1[X(C10H13Cl2O2PS)]
method: RPBEPBE
basis: SDD
operation: Freq
keyword: #p
keyword: freq=noraman
keyword: PBEPBE/SDD
title: #p freq=noraman PBEPBE/SDD
converged: NO YES NO NO
title: Mulliken charges:
elementType: Cl Cl S P O O C C C C C C C C C C H H H H H H H H H H H H H
charge: -0.009988 -0.042072 -0.222572 0.708512 -0.482922 -0.486310 -0.603698 -0.633214 -0.221612 0.494459 -0.261038 -0.299282 -0.654750 -0.195916 -0.204441 -0.101554 0.268129 0.278534 0.227531 0.256907 0.238789 0.240598 0.222387 0.267368 0.212984 0.227376 0.232350 0.282286 0.261158
chargesum: 0.00000
title: Mulliken charges with hydrogens summed into heavy atoms:
elementType: Cl Cl S P O O C C C C C C C C C C
charge: -0.009988 -0.042072 -0.222572 0.708512 -0.482922 -0.486310 -0.057035 0.090014 0.241373 0.494459 -0.261038 -0.031914 0.017960 0.086370 0.056717 -0.101554
polarizability: 2.18533514e+02 1.63249627e+01 1.86858959e+02 9.87960758e+00 -1.10710186e+01 1.29543459e+02
1716.lowfreq: -12.8629 -6.6989 -0.0032 -0.0021 -0.0017 6.5242 13.6121 24.1420 34.7595
frequency: 9.2758 24.0499 34.6081 44.2394 62.0932 88.9949 97.6783 111.2478 134.0880 146.9555 157.7977 163.1592 189.9277 233.4558 245.4776 251.8521 284.5376 291.6070 307.0833 326.6351 372.1716 395.8292 434.5840 451.5124 468.7708 499.2819 543.1796 574.7888 644.6123 665.7835 702.3322 710.9334 720.1698 776.3569 804.7572 824.7484 838.5272 862.0159 874.1052 951.6172 999.2054 1017.9712 1027.7202 1052.7217 1062.8770 1076.5826 1103.0470 1133.4881 1134.5071 1211.8493 1240.0654 1244.6737 1251.7857 1280.8593 1351.7023 1355.5526 1378.4129 1396.0252 1402.2950 1421.8362 1450.9087 1458.8085 1472.7940 1477.6833 1485.6390 1492.3171 1569.0147 1582.5517 2992.0184 2995.6033 2997.1688 3029.4029 3054.4549 3088.6350 3091.6728 3097.0412 3107.1454 3116.2990 3157.5195 3179.5242 3183.1553
redmass: 6.7681 6.4647 5.5006 3.3871 2.8669 2.4004 3.9318 6.6823 7.2302 5.8533 2.0724 5.7995 7.0547 1.7322 1.5264 2.2254 5.3040 4.3314 6.5395 6.2780 10.1357 6.3141 5.0987 4.1142 7.6827 7.4535 6.0024 4.6761 7.9162 6.1635 4.7381 4.9138 7.7825 1.2856 1.0926 1.4561 6.9098 1.3948 3.8533 1.3309 1.8029 2.6084 3.8228 1.3799 2.1012 2.3176 2.1834 1.3745 1.4352 3.4913 1.3672 1.1997 1.1369 1.3249 5.0783 1.2631 4.9686 1.2428 1.1832 1.0799 2.6813 1.0408 1.0363 1.0503 1.0481 1.0796 8.6492 7.2658 1.0489 1.0439 1.0360 1.0585 1.1075 1.1009 1.0984 1.1016 1.1020 1.1023 1.0890 1.0964 1.0941
irintensity: 0.2456 0.2037 0.1337 0.2381 0.1843 5.0493 0.3602 1.8839 1.1597 5.1758 0.5928 0.0479 1.0973 2.3407 1.1865 5.4712 9.8014 4.6796 13.1754 19.0288 0.8341 2.9730 3.2133 9.3558 1.5395 12.8315 68.3690 12.9620 29.2633 76.6399 15.3310 30.2933 175.7017 52.4453 4.5504 39.4799 51.6840 23.1507 132.2263 2.1499 5.4212 121.1862 53.4690 8.6132 4.2846 49.9114 6.4617 1.3126 3.3026 124.8436 20.5681 3.6425 0.8218 6.2399 4.4674 5.3746 10.8281 25.7487 19.5257 7.5302 225.6671 13.3907 17.4932 7.5907 14.5573 8.9294 15.8894 11.1732 18.4809 30.3272 19.3600 4.6143 13.4529 9.8778 24.9367 8.4786 36.2787 15.3875 2.7447 0.7688 1.2518
temp: 298.150 k
press: 1.00000 atm
elementType: 17 17 16 15 8 8 6 6 6 6 6 6 6 6 6 6 1 1 1 1 1 1 1 1 1 1 1 1 1
symmnumber: 1
zpe: 553532.3 jmol-1
zpe.correction: 0.210829 hartree
zpe.thermalcorrener: 0.230019 hartree
zpe.thermalcorrenthalpy: 0.230963 hartree
zpe.thermalcorrgfe: 0.159237 hartree
zpe.sumelectzpe: -2197.504367 hartree
zpe.sumelectthermal: -2197.485178 hartree
zpe.sumelectthermalent: -2197.484234 hartree
zpe.sumelectthermalfe: -2197.555959 hartree
dipole: -2.3354 2.2009 -1.9165
dipole: 3.7378
quadrupole: -119.7961 -113.4588 -130.4557
quadrupole: -0.6985 4.3018 1.8161
quadrupole: 1.4408 7.7780 -9.2188 -0.6985 4.3018 1.8161
hfenergy: -2197.7151966 hartree
pointgroup: C01 [X(C10H13Cl2O2P1S1)]
dipole: -0.9951692 0.574149 -0.917884 debye
polarizability: 209.5445246|23.6410632|190.5012228|14.9705707|-15.2808822|134.8901841 unknown
InChI: InChI=1S/C10H13Cl2O2PS/c1-3-13-15(16,4-2)14-10-6-5-8(11)7-9(10)12/h5-7H,3-4H2,1-2H3
charge 0 multiplicity 1
29 atoms
Cl 1.382473 -2.681247 0.886055
Cl 4.658634 1.790908 0.608342
S  -2.041639 -0.601822 2.264385
P  -2.124467 -0.615241 0.2053
O  -2.703729 0.858642 -0.532308
O  -0.577413 -0.920722 -0.650471
C  -3.122061 -1.888651 -0.716705
C  -2.650214 -3.324843 -0.424767
C  -2.716751 2.123587 0.261768
C  0.614284 -0.268943 -0.305751
C  1.641884 -0.964879 0.377955
C  0.845437 1.065426 -0.718206
C  -3.442318 3.151602 -0.602533
C  2.877037 -0.348258 0.66063
C  2.072115 1.703866 -0.442567
C  3.068686 0.983962 0.246306
H  -4.170761 -1.726946 -0.412465
H  -3.023164 -1.624862 -1.784047
H  -3.297022 -4.038888 -0.96459
H  -1.609438 -3.475253 -0.755622
H  -2.706824 -3.556059 0.653516
H  -3.235088 1.940093 1.221288
H  -1.676471 2.429262 0.482115
H  0.055597 1.583239 -1.272077
H  -3.491477 4.118864 -0.069113
H  -2.91514 3.305658 -1.559495
H  -4.471635 2.820546 -0.821629
H  3.66139 -0.89398 1.190662
H  2.251574 2.733137 -0.764277
