program: Orca
programVersion: 4.2.1
elementType: S O O O O O O O N N N N C C C C C C C C C C C C C C C H H H H H H H H H H H H H H H H H H
charge: 0
multiplicity: 1
keywords: wb97x-d3
keywords: def2-TZVPP
keywords: def2/J RIJCOSX GRIDX6 NOFINALGRIDX
keywords: grid4 nofinalgrid
keywords: scfconv7
keywords: smallprint printgap noloewdin
keywords: NOSOSCF
formula: C15H18N4O7S
InChI: InChI=1S/C15H18N4O7S/c1-4-25-10-7-5-6-8-11(10)26-27(21,22)19-15(20)18-14-16-12(23-2)9-13(17-14)24-3/h5-9,18-19H,4H2,1-3H3
45 atoms
S  2.669809 0.307268 -1.373998
O  2.832382 0.6032 0.210021
O  0.818777 -0.476581 1.593788
O  2.439201 1.550108 -2.062948
O  3.782996 -0.539406 -1.680626
O  -2.316284 1.995858 -0.956468
O  -4.574704 -1.757254 0.576421
O  1.929058 -2.598367 -0.880561
N  1.24111 -0.497629 -1.480355
N  -0.279561 -2.138945 -0.887389
N  -1.297354 -0.049781 -0.984102
N  -2.431567 -1.954269 -0.17927
C  1.892128 1.442461 0.798185
C  0.841503 0.860732 1.517112
C  2.032463 2.813401 0.698382
C  -0.097121 1.707719 2.102487
C  1.098343 3.644792 1.29936
C  0.032746 3.084729 1.985443
C  -0.044715 -1.086668 2.552353
C  1.044369 -1.798688 -1.054477
C  -1.382758 -1.335198 -0.686483
C  0.307431 -2.548221 2.656468
C  -2.359049 0.702553 -0.705561
C  -3.491717 -1.198463 0.071734
C  -3.515721 0.172551 -0.158539
C  -1.139369 2.553044 -1.535558
C  -4.565168 -3.15674 0.846388
H  2.874563 3.230392 0.162262
H  -0.935931 1.306178 2.654159
H  1.203371 4.718058 1.222672
H  -0.710546 3.721126 2.447059
H  -1.09146 -0.961884 2.255946
H  0.081882 -0.600109 3.524422
H  0.388777 0.085611 -1.541623
H  -0.424799 -3.113887 -0.659712
H  0.150499 -3.082516 1.720378
H  1.343728 -2.687846 2.964652
H  -0.330853 -3.011375 3.409192
H  -4.378274 0.782427 0.067122
H  -1.336364 3.616873 -1.636764
H  -0.268822 2.419495 -0.894231
H  -0.941065 2.133971 -2.522814
H  -3.80369 -3.420202 1.580935
H  -5.547618 -3.383009 1.252287
H  -4.407391 -3.742131 -0.059461
elementType: S O N C H
totalener: -1726.39141708 hartree
nucrepener: 3052.86890264 hartree
electener: -4779.26031971 hartree
oneelecener: -8437.31603275 hartree
twoeener: 3658.05571304 hartree
cpcmener: -0.03881941 hartree
kineticenergy: 1720.11442901 hartree
xcener: -141.536095373907 hartree
chargesum: 0.0000000
charge: 0.905906 -0.292819 -0.310198 -0.466428 -0.446085 -0.285148 -0.289613 -0.417293 -0.209991 -0.158338 -0.391350 -0.396715 0.102200 0.247686 -0.076610 -0.181055 -0.180872 -0.182841 0.012366 0.345570 0.306683 -0.270274 0.392931 0.409658 -0.301466 -0.085410 -0.116185 0.139871 0.142397 0.157425 0.159828 0.090442 0.133000 0.214744 0.195466 0.082349 0.097219 0.101579 0.143112 0.143310 0.036023 0.139779 0.113130 0.132227 0.113787
qa: 0.9059 -0.2928 -0.3102 -0.4664 -0.4461 -0.2851 -0.2896 -0.4173 -0.2100 -0.1583 -0.3913 -0.3967 0.1022 0.2477 -0.0766 -0.1811 -0.1809 -0.1828 0.0124 0.3456 0.3067 -0.2703 0.3929 0.4097 -0.3015 -0.0854 -0.1162 0.1399 0.1424 0.1574 0.1598 0.0904 0.1330 0.2147 0.1955 0.0823 0.0972 0.1016 0.1431 0.1433 0.0360 0.1398 0.1131 0.1322 0.1138
va: 6.0872 2.0540 2.0628 2.0179 2.0607 2.1284 2.1340 2.0962 3.0838 3.1567 2.9489 2.9340 3.8051 3.8553 3.8922 3.8252 3.8961 3.9076 3.7982 4.4434 4.2779 3.9564 3.9797 4.0139 3.9336 3.8355 3.8535 1.0086 1.0072 0.9911 0.9905 0.9865 0.9895 1.0753 1.0116 1.0081 1.0069 1.0053 1.0174 0.9970 1.0019 0.9956 0.9935 0.9939 0.9954
dispcorr: -0.031569917 hartree
energy: -1726.422986992384
dipole: -16.81399 12.49313 -4.32086 -1.64760 2.24643 0.59883 15.09892 -13.07006 2.02886
magnitude: 4.81089 au
magnitude: 12.22831 debye
