program: Orca
programVersion: 4.2.1
elementType: S O O O O O O O N N N N C C C C C C C C C C C C C C C H H H H H H H H H H H H H H H H H H
charge: 0
multiplicity: 1
keywords: wb97x-d3
keywords: def2-TZVPP
keywords: def2/J RIJCOSX GRIDX6 NOFINALGRIDX
keywords: grid4 nofinalgrid
keywords: scfconv7
keywords: smallprint printgap noloewdin
keywords: NOSOSCF
formula: C15H18N4O7S
InChI: InChI=1S/C15H18N4O7S/c1-4-25-10-7-5-6-8-11(10)26-27(21,22)19-15(20)18-14-16-12(23-2)9-13(17-14)24-3/h5-9,18-19H,4H2,1-3H3
45 atoms
S  1.077528 1.017988 -2.042566
O  1.636823 -0.441008 -2.42758
O  1.22615 -2.175146 -0.483466
O  2.184225 1.902699 -1.805837
O  0.096864 1.276899 -3.061849
O  -4.091844 1.210789 3.91204
O  -4.148298 0.991655 -0.724129
O  1.926591 0.668166 0.837571
N  0.210441 0.801936 -0.662331
N  -0.190079 0.699471 1.615783
N  -2.136758 0.948866 2.765797
N  -2.172163 0.836688 0.41085
C  2.742295 -0.970736 -1.7715
C  2.507421 -1.911407 -0.764891
C  4.015749 -0.614927 -2.158283
C  3.608279 -2.491551 -0.143541
C  5.107424 -1.198796 -1.528059
C  4.894684 -2.130294 -0.526052
C  0.924784 -3.102153 0.552568
C  0.743672 0.720586 0.603561
C  -1.561815 0.83766 1.584376
C  -0.574046 -3.245438 0.624317
C  -3.455346 1.087796 2.763006
C  -3.494552 0.980072 0.421115
C  -4.21256 1.115366 1.597138
C  -3.339786 1.186249 5.122443
C  -3.416731 0.865858 -1.941133
H  4.157795 0.104332 -2.954095
H  3.480767 -3.221759 0.643707
H  6.110828 -0.925476 -1.823634
H  5.737314 -2.591497 -0.027897
H  1.325311 -2.743477 1.506242
H  1.385828 -4.071895 0.339419
H  -0.820552 0.784844 -0.736708
H  0.212208 0.669276 2.543642
H  -0.831752 -3.942319 1.421295
H  -1.060842 -2.295531 0.843607
H  -0.984392 -3.63553 -0.30713
H  -5.28649 1.2308 1.607325
H  -2.818783 0.238133 5.254885
H  -2.61799 2.001652 5.166049
H  -4.066529 1.30916 5.921014
H  -4.15966 0.888705 -2.733943
H  -2.727114 1.698634 -2.084073
H  -2.87675 -0.080293 -1.99298
elementType: S O N C H
totalener: -1726.39353701 hartree
nucrepener: 2898.82907019 hartree
electener: -4625.22260720 hartree
oneelecener: -8130.38637954 hartree
twoeener: 3505.16377233 hartree
cpcmener: -0.03739723 hartree
kineticenergy: 1720.11174379 hartree
xcener: -141.534033926386 hartree
chargesum: 0.0000000
charge: 0.914182 -0.294526 -0.315398 -0.450127 -0.479354 -0.290360 -0.287565 -0.423847 -0.177348 -0.120127 -0.424347 -0.421448 0.131499 0.287249 -0.126564 -0.197654 -0.189362 -0.176796 0.024096 0.299152 0.359096 -0.265602 0.410782 0.417307 -0.314815 -0.115286 -0.129559 0.142201 0.144030 0.159393 0.159140 0.105422 0.113894 0.208798 0.191976 0.097353 0.069996 0.092914 0.145066 0.113236 0.113759 0.131827 0.138434 0.112472 0.116810
qa: 0.9142 -0.2945 -0.3154 -0.4501 -0.4794 -0.2904 -0.2876 -0.4238 -0.1773 -0.1201 -0.4243 -0.4214 0.1315 0.2872 -0.1266 -0.1977 -0.1894 -0.1768 0.0241 0.2992 0.3591 -0.2656 0.4108 0.4173 -0.3148 -0.1153 -0.1296 0.1422 0.1440 0.1594 0.1591 0.1054 0.1139 0.2088 0.1920 0.0974 0.0700 0.0929 0.1451 0.1132 0.1138 0.1318 0.1384 0.1125 0.1168
va: 6.0751 2.0637 2.0805 2.0297 2.0294 2.1338 2.1434 2.0842 3.0726 3.1643 2.9716 2.9610 3.7930 3.8773 4.0006 3.8775 3.9129 3.9471 3.7990 4.4530 4.2244 3.9770 4.0322 3.9960 3.9252 3.8492 3.8454 1.0057 1.0066 0.9890 0.9898 0.9878 0.9880 1.0774 1.0177 1.0066 1.0041 1.0044 1.0164 0.9959 0.9956 0.9933 0.9963 0.9957 0.9894
dispcorr: -0.025130369 hartree
energy: -1726.418667383103
dipole: -5.71383 3.89535 -1.81848 -14.16828 12.40616 -1.76212 11.90850 -9.32661 2.58189
magnitude: 3.61637 au
magnitude: 9.19207 debye
