program: Orca
programVersion: 6.0.0
elementType: C C C C C C C O O C H H H H H H H
keywords: wb97m-d4rev def2-qzvpd verytightscf defgrid3
formula: C8H7O2
InChI: InChI=1/C8H7O2/c1-6-3-2-4-7(5-6)8(9)10/h2-5H,1H3
17 atoms
C  -2.639005 -0.818026 -0.051667
C  -1.32317 -0.102094 0.123398
C  -1.280113 1.228489 0.522434
C  -0.057883 1.874118 0.678885
C  1.12573 1.195138 0.437937
C  1.10417 -0.137761 0.037584
C  2.423561 -0.905291 -0.234149
O  3.468146 -0.242695 -0.067429
O  2.28558 -2.094666 -0.58742
C  -0.122714 -0.767397 -0.113876
H  -2.75912 -1.177435 -1.07531
H  -3.480138 -0.161926 0.175167
H  -2.704587 -1.688249 0.603931
H  -2.205143 1.762646 0.711835
H  -0.036748 2.912206 0.990641
H  2.091555 1.668175 0.550376
H  -0.108763 -1.804541 -0.426276
totalener: -459.90513418184082 hartree
nucrepener: 474.67895666449635 hartree
electener: -934.58408944035148 hartree
oneelecener: -1576.93332648487922 hartree
twoeener: 642.34923704452774 hartree
kineticenergy: 458.30853359676354 hartree
xcener: -44.990393421108 hartree
energy: -519.4151 -519.4144 -279.0161 -278.5003 -278.4030 -278.1489 -278.1107 -277.6648 -277.6420 -277.5656 -26.5019 -24.1308 -23.2914 -21.0410 -20.0340 -18.6666 -16.1811 -15.5859 -13.5751 -12.4802 -12.0932 -11.4471 -11.0613 -10.4447 -10.3077 -10.1971 -9.6580 -9.0754 -8.6231 -8.6126 -8.1003 -5.6774 -5.4608 -4.6491 -4.5245 -4.4017 3.0553 3.5313 4.0172 4.3775 4.5895 4.7089 4.7805 4.9529 5.2909 5.3662 5.4303 electronvolt
chargesum: -1.0000000
charge: -0.169582 -0.715628 -0.310994 -0.729676 -0.341276 -0.128690 0.146452 -0.728075 -0.730507 -0.070721 0.153439 0.035999 0.152086 0.589334 0.563325 0.669433 0.615083
charge: 0.323258 -0.208081 0.060749 0.062908 0.094758 -0.124304 -1.030419 0.117057 0.117326 0.117470 -0.077871 -0.087370 -0.077898 -0.077629 -0.082476 -0.069976 -0.057501
qa: -0.1696 -0.7156 -0.3110 -0.7297 -0.3413 -0.1287 0.1465 -0.7281 -0.7305 -0.0707 0.1534 0.0360 0.1521 0.5893 0.5633 0.6694 0.6151
va: 3.0607 4.6548 3.8922 4.7574 3.9218 3.7813 3.9623 1.5596 1.5597 3.4255 1.1242 1.2645 1.1228 0.6985 0.5786 0.4302 0.5752
dispersion: -0.023559105 hartree
energy: -459.928693286604 hartree
dipole: -12.138460519 8.526425067 -3.612035452 2.215134550 -0.726455290 1.488679260 1.041039826 -0.481570686 0.559469140
dipolemethod: SCF
magnitude: 3.946640567 au
magnitude: 10.031563100 debye
