program: Orca
programVersion: 4.2.1
elementType: S O O O O O O O N N N N C C C C C C C C C C C C C C C H H H H H H H H H H H H H H H H H H
charge: 0
multiplicity: 1
keywords: wb97x-d3
keywords: def2-TZVPP
keywords: def2/J RIJCOSX GRIDX6 NOFINALGRIDX
keywords: grid4 nofinalgrid
keywords: scfconv7
keywords: smallprint printgap noloewdin
keywords: NOSOSCF
formula: C15H18N4O7S
InChI: InChI=1S/C15H18N4O7S/c1-4-25-10-7-5-6-8-11(10)26-27(21,22)19-15(20)18-14-16-12(23-2)9-13(17-14)24-3/h5-9,18-19H,4H2,1-3H3
45 atoms
S  2.055214 1.459539 0.162089
O  2.597217 0.812233 -1.20889
O  1.072824 -1.208391 -1.936515
O  2.972473 1.149678 1.223054
O  1.741477 2.811122 -0.214398
O  -3.117665 2.959888 -0.175886
O  -5.359655 -0.380899 2.136258
O  1.311144 -1.249249 1.291705
N  0.599028 0.747017 0.440699
N  -0.896434 -0.792177 1.312942
N  -1.99199 1.107397 0.545327
N  -3.124769 -0.59126 1.725774
C  3.151442 -0.46289 -1.213812
C  2.337236 -1.520084 -1.62935
C  4.474922 -0.64648 -0.878157
C  2.897162 -2.79151 -1.691524
C  5.023337 -1.921248 -0.943457
C  4.23014 -2.982088 -1.346878
C  0.162675 -2.248258 -2.273366
C  0.416086 -0.482217 1.032507
C  -2.050446 -0.047432 1.187873
C  -1.164761 -1.608689 -2.592343
C  -3.124915 1.797638 0.447137
C  -4.248625 0.104037 1.615868
C  -4.318357 1.336321 0.975876
C  -1.891373 3.453864 -0.708597
C  -5.319819 -1.643812 2.795327
H  5.078378 0.19954 -0.576478
H  2.308909 -3.643186 -2.00464
H  6.060482 -2.076583 -0.680392
H  4.64634 -3.979482 -1.401166
H  0.066673 -2.948076 -1.436713
H  0.527869 -2.809998 -3.139157
H  -0.25201 1.286554 0.212346
H  -1.016127 -1.683889 1.775878
H  -1.538603 -1.018276 -1.755566
H  -1.096425 -0.959662 -3.465684
H  -1.899414 -2.384376 -2.807451
H  -5.238612 1.896402 0.896716
H  -2.136247 4.403974 -1.175973
H  -1.153128 3.628777 0.075118
H  -1.480792 2.785546 -1.466535
H  -6.332965 -1.822211 3.146043
H  -5.0297 -2.444518 2.114898
H  -4.641859 -1.6340 3.648746
elementType: S O N C H
totalener: -1726.39325388 hartree
nucrepener: 2904.24650634 hartree
electener: -4630.63976022 hartree
oneelecener: -8141.18207088 hartree
twoeener: 3510.54231066 hartree
cpcmener: -0.03741726 hartree
kineticenergy: 1720.10613434 hartree
xcener: -141.532633745507 hartree
chargesum: 0.0000000
charge: 0.914598 -0.294600 -0.316373 -0.449769 -0.479080 -0.287459 -0.289620 -0.421674 -0.176691 -0.119619 -0.424811 -0.423521 0.135828 0.279731 -0.127132 -0.197137 -0.188728 -0.174931 0.022296 0.296975 0.359009 -0.260184 0.419251 0.410721 -0.315363 -0.129567 -0.116906 0.143317 0.142939 0.159227 0.160137 0.106412 0.114566 0.208080 0.191967 0.061422 0.095558 0.098095 0.145320 0.138991 0.112547 0.116147 0.132458 0.113863 0.113712
qa: 0.9146 -0.2946 -0.3164 -0.4498 -0.4791 -0.2875 -0.2896 -0.4217 -0.1767 -0.1196 -0.4248 -0.4235 0.1358 0.2797 -0.1271 -0.1971 -0.1887 -0.1749 0.0223 0.2970 0.3590 -0.2602 0.4193 0.4107 -0.3154 -0.1296 -0.1169 0.1433 0.1429 0.1592 0.1601 0.1064 0.1146 0.2081 0.1920 0.0614 0.0956 0.0981 0.1453 0.1390 0.1125 0.1161 0.1325 0.1139 0.1137
va: 6.0736 2.0620 2.0761 2.0308 2.0297 2.1431 2.1339 2.0861 3.0741 3.1629 2.9568 2.9743 3.7894 3.8847 3.9999 3.8799 3.9091 3.9412 3.8003 4.4494 4.2267 3.9767 3.9932 4.0311 3.9272 3.8463 3.8489 1.0052 1.0072 0.9890 0.9891 0.9888 0.9880 1.0780 1.0176 1.0062 1.0044 1.0068 1.0163 0.9961 0.9958 0.9890 0.9932 0.9955 0.9957
dispcorr: -0.025478902 hartree
energy: -1726.418732777976
dipole: -12.52373 9.47464 -3.04909 -12.45359 10.60188 -1.85171 -7.87471 7.19560 -0.67910
magnitude: 3.63139 au
magnitude: 9.23025 debye
