program: Orca
programVersion: 6.0.0
elementType: C C C C C O O H H H H H H H H H H
keywords: wb97m-d4rev def2-qzvpd verytightscf defgrid3
formula: C5H10O2
InChI: InChI=1/C5H10O2/c1-5(2,3)4(6)7/h6H,1-3H3
17 atoms
C  -0.568507 -0.167901 1.531293
C  -0.095452 0.00167 0.09053
C  -0.817065 -0.995564 -0.826104
C  -0.359489 1.435258 -0.38968
C  1.399997 -0.268272 0.025967
O  1.89397 -0.13558 -1.227634
O  2.105891 -0.567961 0.951769
H  -0.057299 0.524705 2.197418
H  -0.377647 -1.176967 1.892004
H  -1.640231 0.02412 1.585625
H  -1.891982 -0.823056 -0.769441
H  -0.503639 -0.881042 -1.861633
H  -0.623982 -2.023292 -0.517451
H  0.163929 2.16078 0.233559
H  -1.427419 1.644769 -0.326043
H  -0.04204 1.572982 -1.421145
H  2.841065 -0.324548 -1.168932
totalener: -347.25970455086167 hartree
nucrepener: 330.18471632593753 hartree
electener: -677.44442142598268 hartree
oneelecener: -1125.38630396447411 hartree
twoeener: 447.94188253849148 hartree
kineticenergy: 345.99392210616520 hartree
xcener: -33.860851385258 hartree
energy: -527.4056 -525.8660 -285.1818 -282.3984 -281.4330 -281.4328 -281.1986 -33.8691 -31.3614 -26.1347 -22.3382 -22.2222 -21.2138 -18.4326 -16.6498 -16.4431 -15.8680 -14.9201 -14.7166 -14.6004 -13.5952 -13.4416 -12.9078 -12.7136 -11.9973 -11.9733 -11.7795 -10.4198 0.5805 0.9824 1.2497 1.2886 1.8523 1.8762 1.9886 2.3308 2.3515 2.6412 2.6754 electronvolt
chargesum: -0.0000000
charge: -0.647018 -0.953330 -0.836968 -0.836719 0.273315 -0.483648 -0.528514 0.425381 0.426033 0.403961 0.379872 0.422086 0.440317 0.439454 0.380173 0.422545 0.273060
charge: 0.340055 -0.417943 0.354922 0.354909 -0.735307 0.637334 0.325475 -0.057954 -0.057960 -0.059852 -0.058600 -0.062771 -0.054885 -0.054887 -0.058607 -0.062781 -0.331149
qa: -0.6470 -0.9533 -0.8370 -0.8367 0.2733 -0.4836 -0.5285 0.4254 0.4260 0.4040 0.3799 0.4221 0.4403 0.4395 0.3802 0.4225 0.2731
va: 3.5755 6.8571 3.4936 3.4945 3.6808 1.9069 1.8952 0.7232 0.7233 1.0318 1.0780 0.8209 0.8626 0.8625 1.0780 0.8199 0.9849
dispersion: -0.016908978 hartree
energy: -347.276613529323 hartree
dipole: -8.358780168 7.952472096 -0.406308072 1.611455291 -1.439733140 0.171722151 -0.207414129 -0.321627364 -0.529041492
dipolemethod: SCF
magnitude: 0.688810313 au
magnitude: 1.750816675 debye
