program: Orca
programVersion: 6.0.1
elementType: O C C C C C C C C O H H H H H H H H
keywords: wb97m-d4rev def2-qzvpd verytightscf defgrid3 smd(water) draco energy
formula: C8H8O2
InChI: InChI=1/C8H8O2/c1-6-4-2-3-5-7(6)8(9)10/h2-5,9H,1H3
18 atoms
O  -0.720844 2.837355 -0.455475
C  -1.105595 1.673767 0.096746
C  -0.055287 0.62528 0.034938
C  -0.391948 -0.736674 0.027301
C  -1.806294 -1.246582 0.029487
C  0.651852 -1.658082 -0.008081
C  1.978874 -1.258589 -0.017201
C  2.299246 0.091003 -0.006766
C  1.280727 1.026381 0.00879
O  -2.203593 1.540231 0.596162
H  -1.440515 3.478145 -0.337906
H  -2.426453 -0.721981 -0.695078
H  -2.271659 -1.118225 1.006007
H  -1.813056 -2.307555 -0.212017
H  0.411357 -2.712785 -0.030724
H  2.762834 -2.003634 -0.037256
H  3.331145 0.412513 -0.014529
H  1.518909 2.079432 0.015302
totalener: -460.46412661930214 hartree
nucrepener: 498.49091338256585 hartree
electener: -958.94063010610807 hartree
oneelecener: -1612.76716136376353 hartree
twoeener: 653.82653125765546 hartree
cpcmener: -0.02227713960692 hartree
kineticenergy: 458.82590461926486 hartree
energy: -527.3174 -526.0124 -285.5462 -282.1916 -282.0659 -281.7930 -281.7172 -281.5549 -281.5259 -281.1218 -33.8734 -31.4217 -27.1739 -24.6009 -24.3009 -22.1713 -21.0227 -19.7617 -18.8277 -17.4175 -16.8136 -16.0325 -15.8874 -15.3207 -14.9560 -14.2400 -14.0140 -13.8944 -13.1982 -12.8443 -12.4274 -12.0978 -11.8599 -10.8046 -9.6307 -9.2993 0.6611 0.8538 1.2270 1.2769 1.5735 1.7795 1.8147 1.9501 2.0493 2.5730 2.6156 electronvolt
chargesum: -0.0000000
charge: -0.553658 0.295587 0.579897 -0.470317 -0.201609 -0.428785 -0.494561 -0.479322 -0.645215 -0.641400 0.438389 0.291369 0.141245 0.009426 0.522972 0.588065 0.602383 0.445535
charge: 0.643849 -0.711777 -0.107862 -0.140526 0.353949 0.109393 0.098859 0.096110 0.123690 0.244965 -0.296258 -0.065057 -0.063536 -0.067409 -0.052155 -0.056356 -0.059883 -0.049996
qa: -0.5537 0.2956 0.5799 -0.4703 -0.2016 -0.4288 -0.4946 -0.4793 -0.6452 -0.6414 0.4384 0.2914 0.1412 0.0094 0.5230 0.5881 0.6024 0.4455
va: 1.8756 3.7422 2.5169 4.3701 3.0913 4.2035 4.4480 4.3816 4.2799 1.6998 0.7887 0.8554 1.1717 1.5139 0.9011 0.5501 0.5212 0.9296
dispersion: -0.023389450 hartree
energy: -460.487516069453 hartree
dipole: 0.714660120 0.202201420 0.916861540 -5.378933183 5.290648215 -0.088284969 -0.502500465 0.103488278 -0.399012187
dipolemethod: SCF
magnitude: 1.003812754 au
magnitude: 2.551489250 debye
