program: Gaussian 09
title: 000069058
version: EM64L-G09RevD.01
frameworkgroup: C1[X(C9H9NO4)]
method: RPBEPBE
basis: SDD
operation: Freq
keyword: #pfreq=noraman
keyword: PBEPBE/SDD
title: #p freq=noraman PBEPBE/SDD
converged: YES YES NO NO
title: Mulliken charges:
elementType: O O O O N C C C C C C C C C H H H H H H H H H
charge: -0.278631 -0.237014 -0.249162 -0.224512 -0.000772 0.135180 -0.016857 -0.247728 -0.162597 0.188606 0.202472 -0.345449 -0.494152 -0.497524 0.284134 0.240659 0.253237 0.245557 0.249346 0.234017 0.237121 0.248216 0.235853
chargesum: 0.00000
title: Mulliken charges with hydrogens summed into heavy atoms:
elementType: O O O O N C C C C C C C C C
charge: -0.278631 -0.237014 -0.249162 -0.224512 -0.000772 0.135180 -0.016857 0.036406 0.078061 0.188606 0.202472 -0.092212 0.234768 0.223667
polarizability: 1.50491972e+02 -5.29499609e+00 1.26998383e+02 -2.18454880e+00 1.62252374e+00 6.81228504e+01
1716.lowfreq: -5.9837 -0.0006 -0.0005 -0.0003 2.4222 3.4829 13.8978 55.9385 77.8007
frequency: 13.7383 55.9342 77.7996 85.7991 94.3120 100.8176 123.5556 134.3774 191.8676 235.8275 258.4076 285.9823 313.7309 341.3658 390.4260 427.4502 484.1828 554.1475 626.0399 691.5581 696.1327 717.9801 755.9872 783.7388 814.2923 836.2968 914.5444 918.8714 962.1517 1005.9652 1028.0688 1053.4811 1105.5712 1108.4704 1111.3798 1113.6749 1149.1311 1152.4618 1206.0276 1263.0191 1281.5558 1308.2179 1412.8062 1416.5482 1426.3011 1433.7108 1450.8488 1452.8025 1460.9093 1462.0409 1545.3609 1579.8742 1620.6609 1639.5887 3004.5641 3008.6673 3106.9904 3112.8095 3139.8672 3152.4829 3155.4968 3157.6063 3177.5149
redmass: 5.6777 3.5497 1.8977 1.3564 1.6215 2.6431 4.9649 4.1883 4.8015 6.0558 5.5031 4.7264 4.8135 6.0466 7.4754 5.0831 7.3770 3.4761 7.7761 6.7456 7.2166 7.6063 5.7037 3.8587 3.3588 2.0984 8.6391 8.2199 1.4250 1.3858 4.5362 4.1141 2.2466 1.5970 1.7282 1.3008 1.4871 1.5385 1.6771 3.5808 2.9211 8.0729 1.4785 1.3955 1.6475 2.0115 1.0502 1.0505 1.0518 1.0520 6.4277 6.3533 10.1968 10.8471 1.0295 1.0294 1.1045 1.1049 1.0892 1.1048 1.1048 1.0914 1.1002
irintensity: 0.9256 2.3299 0.1096 0.3074 4.0153 6.9413 0.9592 4.8482 0.4854 2.4749 5.3402 14.7718 10.8178 7.1948 4.2633 4.1391 3.4900 5.1885 4.2834 8.4956 8.5753 26.2696 22.4983 24.9607 8.1949 19.3466 6.8588 2.8031 0.3807 1.2225 29.5973 76.0396 77.1944 81.2522 96.5316 8.8334 21.4547 57.9017 22.3585 258.0241 87.6748 18.4305 35.7518 13.6360 18.7462 14.3007 7.5906 17.3752 15.6138 5.1230 7.1669 39.8264 203.5896 171.3764 31.7568 30.4297 24.2470 20.0611 9.2271 15.0831 13.1518 4.2067 18.4674
temp: 298.150 k
press: 1.00000 atm
elementType: 8 8 8 8 7 6 6 6 6 6 6 6 6 6 1 1 1 1 1 1 1 1 1
symmnumber: 1
zpe: 440774.8 jmol-1
zpe.correction: 0.167882 hartree
zpe.thermalcorrener: 0.181920 hartree
zpe.thermalcorrenthalpy: 0.182864 hartree
zpe.thermalcorrgfe: 0.124780 hartree
zpe.sumelectzpe: -702.960518 hartree
zpe.sumelectthermal: -702.946481 hartree
zpe.sumelectthermalent: -702.945536 hartree
zpe.sumelectthermalfe: -703.003620 hartree
dipole: -0.4364 0.4676 -2.0138
dipole: 2.1129
quadrupole: -55.9297 -82.8714 -86.3967
quadrupole: -4.5147 2.9318 0.9929
quadrupole: 19.1362 -7.8055 -11.3308 -4.5147 2.9318 0.9929
hfenergy: -703.1284005 hartree
pointgroup: C01 [X(C9H9N1O4)]
dipole: 0.1296298 -0.0947979 0.8156248 debye
dipolederiv: -0.5815793 0.0242589 -0.0110204 0.3160052 -1.3736602 0.2342905 -0.0877604 0.2611616 -0.3014291 -0.560459 -0.3799564 0.2933813 -0.3875505 -0.8558574 0.2694029 0.3943517 0.4244464 -0.8213304 -1.0042079 -0.1754904 0.0401841 0.0521516 -0.629179 0.0690307 -0.0147346 0.0693845 -0.3348627 -0.4199603 -0.1564556 0.0647624 -0.0850225 -0.6621504 -0.2901975 0.1710661 0.0667867 -0.8417059 -0.3042826 0.0940497 -0.0073124 0.0339798 -0.6153373 -0.0142995 -0.0138995 0.0165072 -0.2082046 -0.3734332 0.0836564 -0.0460122 0.1925276 -0.4380931 0.0394497 -0.0483843 0.019108 0.0369466 0.2646769 -0.0061131 0.0568845 0.0348561 0.3303984 0.0279462 0.033429 0.0380352 -0.0140033 0.0956193 0.0536318 0.0178653 -0.1189988 0.1366905 -0.0195417 0.0339572 -0.0030167 -0.0715668 -0.3384259 0.1315496 -0.0317779 0.0274124 0.0645342 -0.0043019 -0.0056474 -0.0012756 -0.1107276 1.3412816 0.105997 -0.0394764 -0.3665822 1.6339222 -0.3076802 0.0601747 -0.2948358 0.2973513 0.6835435 0.4272393 -0.3430676 0.3930074 1.0507562 0.0641319 -0.5106568 -0.4566558 1.3863572 0.3209661 -0.1796938 0.0392064 -0.0307371 0.2803987 0.0025632 0.0372928 -0.0032915 -0.0389304 0.3664666 -0.2439845 0.0425751 -0.2208638 0.5441777 -0.0518136 0.0452907 -0.0662011 0.2783328 0.3506224 0.1320966 -0.0476905 0.1854407 0.5349544 -0.1370998 -0.0310248 -0.0715693 0.2487138 0.0263926 -0.0651735 -0.0142643 -0.0302301 0.1187665 -0.0042378 -0.0217429 0.0035251 0.1442708 0.0914322 -0.0353907 -0.0080625 -0.0119667 -0.0980756 0.0039035 -0.0074294 -0.0020576 0.1596049 -0.0006531 0.1140725 -0.0133471 0.080075 -0.0202044 0.0089552 -0.0262602 0.0135946 0.1324459 -0.0120596 0.0674305 -0.0980763 -0.0150292 0.029293 -0.0622014 -0.091181 -0.0134447 -0.0254254 0.0057197 0.0970079 0.0510814 0.0260788 0.0381961 0.0357868 0.084053 -0.0196772 -0.0570931 0.0516964 -0.0969416 0.0235977 -0.0287382 -0.078051 0.041633 0.0128012 0.0368844 0.107065 -0.0512176 0.1041244 0.0256262 0.0225975 -0.0601785 0.0257089 0.0270188 -0.0492875 0.094708 -0.0236093 -0.049619 -0.0673241 -0.0372497 0.0068031 0.0474791 -0.1359798 -0.0385551 0.0082113 0.0714705 -0.0462961 0.0722674 -0.0311633 0.0618959 0.0210917 0.0952661 0.0704344 -0.0687285 unknown
polarizability: 126.5151739|-4.016211|150.4552386|2.2735789|-6.7353565|68.642793 unknown
InChI: InChI=1S/C9H9NO4/c1-13-8(11)6-4-3-5-10-7(6)9(12)14-2/h3-5H,1-2H3
charge 0 multiplicity 1
23 atoms
O  1.443945 -1.236988 0.386232
O  -1.707492 -1.386959 0.787034
O  3.015773 0.445054 0.040589
O  -0.990922 -1.564608 -1.425308
N  -1.75616 1.411053 -0.315351
C  0.639539 0.975016 -0.051682
C  -0.708324 0.540971 -0.202124
C  0.892627 2.371092 -0.051914
C  -0.180295 3.27326 -0.178015
C  1.819341 0.072077 0.114176
C  -1.111433 -0.910092 -0.367424
C  -1.487521 2.747103 -0.296409
C  2.55093 -2.214026 0.517819
C  -2.219027 -2.777697 0.712037
H  1.927928 2.711547 0.049574
H  -0.016324 4.354634 -0.180895
H  -2.357865 3.407219 -0.381225
H  3.215247 -1.922583 1.348266
H  3.130698 -2.255274 -0.419048
H  2.05502 -3.172953 0.720481
H  -1.393945 -3.473613 0.484343
H  -2.988771 -2.855324 -0.073775
H  -2.64357 -2.972509 1.706321
