program: Orca
programVersion: 4.2.1
elementType: S O O O O O O O N N N N C C C C C C C C C C C C C C C H H H H H H H H H H H H H H H H H H
charge: 0
multiplicity: 1
keywords: wb97x-d3
keywords: def2-TZVPP
keywords: def2/J RIJCOSX GRIDX6 NOFINALGRIDX
keywords: grid4 nofinalgrid
keywords: scfconv7
keywords: smallprint printgap noloewdin
keywords: NOSOSCF
formula: C15H18N4O7S
InChI: InChI=1S/C15H18N4O7S/c1-4-25-10-7-5-6-8-11(10)26-27(21,22)19-15(20)18-14-16-12(23-2)9-13(17-14)24-3/h5-9,18-19H,4H2,1-3H3
45 atoms
S  2.414102 0.640784 -1.497963
O  2.760097 0.25638 0.050058
O  0.595353 -1.083587 1.086383
O  2.192321 2.061165 -1.568481
O  3.412849 -0.036252 -2.256364
O  -2.401542 2.327434 -0.027521
O  -4.919157 -1.568979 0.139897
O  1.461526 -2.239478 -1.868759
N  0.915953 -0.013751 -1.720935
N  -0.7017 -1.668289 -1.571225
N  -1.545762 0.37046 -0.837404
N  -2.807984 -1.619704 -0.720802
C  2.004292 0.836447 1.043972
C  0.938969 0.122535 1.592515
C  2.331464 2.097915 1.516862
C  0.208273 0.696576 2.627112
C  1.600487 2.654746 2.55309
C  0.536233 1.95483 3.104646
C  0.988604 -2.233847 1.834592
C  0.649329 -1.37119 -1.71409
C  -1.720509 -0.929412 -1.017158
C  2.471271 -2.524047 1.751593
C  -2.540707 1.037643 -0.262936
C  -3.802384 -0.936314 -0.175201
C  -3.730068 0.424587 0.098239
C  -1.157004 2.951927 -0.315992
C  -5.006608 -2.95982 -0.124512
H  3.162755 2.63095 1.076482
H  -0.633165 0.153836 3.039338
H  1.858513 3.637144 2.923924
H  -0.044616 2.3915 3.905869
H  0.41601 -3.055727 1.404572
H  0.672393 -2.123071 2.878322
H  0.123673 0.595241 -1.471861
H  -0.901068 -2.654928 -1.639942
H  3.069892 -1.735821 2.208511
H  2.685803 -3.448947 2.288668
H  2.790395 -2.647394 0.718225
H  -4.542324 0.966677 0.557136
H  -1.281626 3.993836 -0.034772
H  -0.342216 2.521783 0.267687
H  -0.907816 2.897638 -1.376377
H  -4.899698 -3.178167 -1.187356
H  -4.251694 -3.524658 0.423362
H  -5.996487 -3.259737 0.20915
totalener: -1726.36539641 hartree
nucrepener: 3032.60381789 hartree
electener: -4758.96921430 hartree
oneelecener: -8396.70562402 hartree
twoeener: 3637.73640972 hartree
kineticenergy: 1720.15950398 hartree
xcener: -141.531120826967 hartree
chargesum: -0.0000000
charge: 0.875549 -0.285253 -0.333191 -0.442579 -0.381093 -0.262192 -0.263769 -0.327716 -0.193674 -0.167582 -0.409796 -0.398220 0.106922 0.212047 -0.054736 -0.217656 -0.146236 -0.103517 0.031878 0.290650 0.360008 -0.243813 0.386710 0.381954 -0.300202 -0.086349 -0.124762 0.127949 0.131559 0.130853 0.130733 0.086135 0.081064 0.192649 0.164359 0.082716 0.088698 0.110882 0.127585 0.125694 0.054805 0.122232 0.109187 0.106261 0.123256
qa: 0.8755 -0.2853 -0.3332 -0.4426 -0.3811 -0.2622 -0.2638 -0.3277 -0.1937 -0.1676 -0.4098 -0.3982 0.1069 0.2120 -0.0547 -0.2177 -0.1462 -0.1035 0.0319 0.2906 0.3600 -0.2438 0.3867 0.3820 -0.3002 -0.0863 -0.1248 0.1279 0.1316 0.1309 0.1307 0.0861 0.0811 0.1926 0.1644 0.0827 0.0887 0.1109 0.1276 0.1257 0.0548 0.1222 0.1092 0.1063 0.1233
va: 6.0871 2.0403 1.9351 2.0408 2.1346 2.1555 2.1488 2.1807 3.0946 3.1458 2.9606 2.9621 3.9169 3.8258 3.9386 4.0211 3.9511 3.9025 3.8576 4.4680 4.2494 3.9097 4.0102 4.0622 3.9323 3.8706 3.8774 1.0130 1.0073 1.0003 0.9990 0.9968 0.9980 1.0901 1.0371 1.0027 1.0119 1.0132 1.0226 0.9996 1.0008 0.9982 0.9969 0.9972 0.9942
dispcorr: -0.030560941 hartree
energy: -1726.395957349082
dipole: -7.87653 5.73951 -2.13702 -5.13216 5.07638 -0.05578 16.01332 -14.11565 1.89767
magnitude: 2.85851 au
magnitude: 7.26576 debye
