program: Orca
programVersion: 4.2.1
elementType: S O O O O O O O N N N N C C C C C C C C C C C C C C C H H H H H H H H H H H H H H H H H H
charge: 0
multiplicity: 1
keywords: wb97x-d3
keywords: def2-TZVPP
keywords: def2/J RIJCOSX GRIDX6 NOFINALGRIDX
keywords: grid4 nofinalgrid
keywords: scfconv7
keywords: smallprint printgap noloewdin
keywords: NOSOSCF
formula: C15H18N4O7S
InChI: InChI=1S/C15H18N4O7S/c1-4-25-10-7-5-6-8-11(10)26-27(21,22)19-15(20)18-14-16-12(23-2)9-13(17-14)24-3/h5-9,18-19H,4H2,1-3H3
45 atoms
S  2.691782 0.306507 -1.379076
O  2.82192 0.580385 0.223033
O  0.771378 -0.45759 1.592253
O  2.432927 1.561298 -2.034294
O  3.806582 -0.525072 -1.687728
O  -2.362724 1.974272 -0.981107
O  -4.570123 -1.799382 0.578537
O  1.912103 -2.627944 -0.895113
N  1.258247 -0.509976 -1.497611
N  -0.289839 -2.14123 -0.929551
N  -1.317142 -0.056433 -1.001662
N  -2.428281 -1.972242 -0.183731
C  1.903995 1.430952 0.801458
C  0.837141 0.880135 1.522877
C  2.06779 2.800295 0.706683
C  -0.074636 1.747436 2.119343
C  1.161107 3.653948 1.317989
C  0.089279 3.121444 2.013064
C  -0.066666 -1.044291 2.574251
C  1.056918 -1.810958 -1.078635
C  -1.384726 -1.343163 -0.699117
C  0.256597 -2.516271 2.663715
C  -2.385861 0.683319 -0.721872
C  -3.494732 -1.227357 0.066285
C  -3.536899 0.141595 -0.169531
C  -1.181667 2.548357 -1.527435
C  -4.53846 -3.195332 0.83042
H  2.913769 3.193348 0.160271
H  -0.921306 1.361077 2.669481
H  1.294261 4.724188 1.245712
H  -0.631817 3.774783 2.485542
H  -1.122002 -0.899989 2.313387
H  0.101706 -0.56073 3.543238
H  0.418254 0.078165 -1.56089
H  -0.431117 -3.110432 -0.68688
H  0.049048 -3.033422 1.729192
H  1.303968 -2.675691 2.914648
H  -0.354484 -2.9743 3.441238
H  -4.407734 0.740009 0.049233
H  -1.401349 3.604804 -1.651864
H  -0.329168 2.440586 -0.857076
H  -0.934223 2.117518 -2.498368
H  -3.759576 -3.460495 1.546196
H  -5.512018 -3.440245 1.246386
H  -4.378785 -3.768358 -0.083251
totalener: -1726.36685096 hartree
nucrepener: 3045.00992891 hartree
electener: -4771.37677987 hartree
oneelecener: -8420.96296318 hartree
twoeener: 3649.58618331 hartree
kineticenergy: 1720.15572068 hartree
xcener: -141.532432928659 hartree
chargesum: -0.0000000
charge: 0.886770 -0.276749 -0.283591 -0.442689 -0.377210 -0.258413 -0.262399 -0.316533 -0.216893 -0.183946 -0.392771 -0.386842 0.081348 0.240401 -0.041612 -0.178972 -0.155997 -0.154173 -0.016172 0.315963 0.305921 -0.248251 0.381766 0.376056 -0.293678 -0.093458 -0.123165 0.123689 0.118211 0.128161 0.128265 0.077252 0.121268 0.196852 0.171624 0.081387 0.104105 0.085185 0.127575 0.128401 0.057052 0.127563 0.104030 0.125084 0.109585
qa: 0.8868 -0.2767 -0.2836 -0.4427 -0.3772 -0.2584 -0.2624 -0.3165 -0.2169 -0.1839 -0.3928 -0.3868 0.0813 0.2404 -0.0416 -0.1790 -0.1560 -0.1542 -0.0162 0.3160 0.3059 -0.2483 0.3818 0.3761 -0.2937 -0.0935 -0.1232 0.1237 0.1182 0.1282 0.1283 0.0773 0.1213 0.1969 0.1716 0.0814 0.1041 0.0852 0.1276 0.1284 0.0571 0.1276 0.1040 0.1251 0.1096
va: 6.0839 2.0709 2.0762 2.0377 2.1405 2.1522 2.1489 2.1959 3.0959 3.1429 2.9452 2.9341 3.9343 3.8397 3.9169 3.8715 3.9393 3.9619 3.8510 4.4378 4.2743 3.9638 4.0079 4.0442 3.9308 3.8593 3.8805 1.0150 1.0143 1.0012 1.0009 0.9810 0.9902 1.0797 1.0311 1.0128 1.0103 1.0060 1.0228 0.9985 1.0009 0.9980 0.9948 0.9942 0.9969
dispcorr: -0.031275776 hartree
energy: -1726.398126739146
dipole: -16.77310 13.87401 -2.89909 -1.49253 1.86929 0.37676 15.19386 -13.72177 1.47209
magnitude: 3.27318 au
magnitude: 8.31977 debye
