program: Orca
programVersion: 4.2.1
elementType: S O O O O O O O N N N N C C C C C C C C C C C C C C C H H H H H H H H H H H H H H H H H H
charge: 0
multiplicity: 1
keywords: wb97x-d3
keywords: def2-TZVPP
keywords: def2/J RIJCOSX GRIDX6 NOFINALGRIDX
keywords: grid4 nofinalgrid
keywords: scfconv7
keywords: smallprint printgap noloewdin
keywords: NOSOSCF
formula: C15H18N4O7S
InChI: InChI=1S/C15H18N4O7S/c1-4-25-10-7-5-6-8-11(10)26-27(21,22)19-15(20)18-14-16-12(23-2)9-13(17-14)24-3/h5-9,18-19H,4H2,1-3H3
45 atoms
S  2.685817 0.557422 -1.295643
O  2.815277 0.581806 0.329475
O  0.812942 -0.735079 1.506409
O  2.410356 1.895396 -1.748173
O  3.81119 -0.200892 -1.728778
O  -2.395117 2.0898 -0.739305
O  -4.580374 -1.892228 0.215482
O  1.940225 -2.42803 -1.280496
N  1.262479 -0.248193 -1.540448
N  -0.266259 -1.966096 -1.234406
N  -1.319957 0.094965 -1.021734
N  -2.420636 -1.930784 -0.514624
C  1.869603 1.296148 1.033309
C  0.82506 0.597807 1.652358
C  1.981391 2.668042 1.158944
C  -0.120092 1.322832 2.373167
C  1.0428 3.377946 1.893939
C  -0.008569 2.701621 2.487886
C  -0.008048 -1.506004 2.367423
C  1.076077 -1.601371 -1.332139
C  -1.376035 -1.22274 -0.911635
C  0.387298 -2.957052 2.234921
C  -2.406201 0.77505 -0.66797
C  -3.503336 -1.241269 -0.186978
C  -3.562033 0.146565 -0.229925
C  -1.203503 2.748572 -1.150293
C  -4.531575 -3.309055 0.275961
H  2.811227 3.174622 0.686136
H  -0.952508 0.820902 2.846682
H  1.134617 4.450299 1.994041
H  -0.754445 3.24403 3.05315
H  -1.065215 -1.371776 2.109241
H  0.122737 -1.173539 3.403355
H  0.413946 0.331935 -1.514625
H  -0.398628 -2.962287 -1.144676
H  -0.220824 -3.56071 2.908489
H  0.234936 -3.328289 1.22356
H  1.434095 -3.106026 2.494717
H  -4.446938 0.697287 0.049176
H  -1.434352 3.80976 -1.128212
H  -0.375754 2.551982 -0.468994
H  -0.912591 2.467224 -2.163191
H  -3.764261 -3.658791 0.967459
H  -5.509815 -3.62087 0.631807
H  -4.342945 -3.75015 -0.703019
totalener: -1726.36702351 hartree
nucrepener: 3043.20181935 hartree
electener: -4769.56884287 hartree
oneelecener: -8417.35074742 hartree
twoeener: 3647.78190456 hartree
kineticenergy: 1720.15852401 hartree
xcener: -141.533356704658 hartree
chargesum: -0.0000000
charge: 0.886815 -0.276326 -0.282720 -0.443426 -0.377331 -0.259029 -0.262303 -0.316426 -0.216516 -0.180734 -0.392164 -0.388489 0.079429 0.242247 -0.038901 -0.181962 -0.160201 -0.149996 -0.017836 0.311794 0.304825 -0.243836 0.383920 0.377883 -0.293244 -0.089918 -0.123041 0.123588 0.118755 0.127682 0.128063 0.078171 0.119368 0.196626 0.171545 0.084168 0.081296 0.102211 0.128231 0.127469 0.055648 0.126195 0.103651 0.124724 0.110098
qa: 0.8868 -0.2763 -0.2827 -0.4434 -0.3773 -0.2590 -0.2623 -0.3164 -0.2165 -0.1807 -0.3922 -0.3885 0.0794 0.2422 -0.0389 -0.1820 -0.1602 -0.1500 -0.0178 0.3118 0.3048 -0.2438 0.3839 0.3779 -0.2932 -0.0899 -0.1230 0.1236 0.1188 0.1277 0.1281 0.0782 0.1194 0.1966 0.1715 0.0842 0.0813 0.1022 0.1282 0.1275 0.0556 0.1262 0.1037 0.1247 0.1101
va: 6.0851 2.0709 2.0769 2.0375 2.1406 2.1544 2.1489 2.1956 3.0938 3.1445 2.9472 2.9350 3.9349 3.8320 3.9096 3.8792 3.9392 3.9592 3.8535 4.4406 4.2752 3.9641 4.0058 4.0446 3.9324 3.8608 3.8799 1.0153 1.0142 1.0017 1.0006 0.9813 0.9901 1.0816 1.0313 1.0060 1.0137 1.0100 1.0225 0.9988 1.0008 0.9984 0.9954 0.9944 0.9969
dispcorr: -0.031128612 hartree
energy: -1726.398152123695
dipole: -16.59167 13.67579 -2.91588 -4.32827 4.40725 0.07898 14.67349 -13.16682 1.50667
magnitude: 3.28308 au
magnitude: 8.34493 debye
