program: Orca
programVersion: 4.2.1
elementType: S O O O O O O O N N N N C C C C C C C C C C C C C C C H H H H H H H H H H H H H H H H H H
charge: 0
multiplicity: 1
keywords: wb97x-d3
keywords: def2-TZVPP
keywords: def2/J RIJCOSX GRIDX6 NOFINALGRIDX
keywords: grid4 nofinalgrid
keywords: scfconv7
keywords: smallprint printgap noloewdin
keywords: NOSOSCF
formula: C15H18N4O7S
InChI: InChI=1S/C15H18N4O7S/c1-4-25-10-7-5-6-8-11(10)26-27(21,22)19-15(20)18-14-16-12(23-2)9-13(17-14)24-3/h5-9,18-19H,4H2,1-3H3
45 atoms
S  2.56181 1.261945 -1.023099
O  2.832735 0.282168 0.252511
O  0.847804 -1.472938 0.511512
O  2.293716 2.586223 -0.527249
O  3.620132 0.963097 -1.928965
O  -2.370951 2.05969 0.791707
O  -4.668746 -1.690476 -0.692785
O  1.7153 -1.153454 -2.729735
N  1.097089 0.742051 -1.587581
N  -0.461679 -0.857245 -2.220319
N  -1.40887 0.649377 -0.72434
N  -2.562442 -1.273394 -1.460822
C  1.984966 0.391498 1.333944
C  0.957644 -0.548825 1.478094
C  2.177757 1.387408 2.273445
C  0.118541 -0.446187 2.584336
C  1.342354 1.472239 3.377165
C  0.311461 0.558991 3.520873
C  0.094726 -2.652231 0.74067
C  0.880291 -0.476663 -2.203422
C  -1.515043 -0.465508 -1.430019
C  0.755789 -3.590807 1.729958
C  -2.43758 0.97102 0.053426
C  -3.589828 -0.927237 -0.699762
C  -3.58923 0.201048 0.111804
C  -1.17569 2.830712 0.775571
C  -4.686832 -2.84427 -1.518004
H  2.989448 2.088869 2.139442
H  -0.69462 -1.145067 2.724977
H  1.496875 2.248485 4.113312
H  -0.35273 0.618655 4.372642
H  0.028934 -3.127615 -0.237324
H  -0.930472 -2.410737 1.042901
H  0.275719 1.165425 -1.135971
H  -0.623453 -1.712795 -2.730082
H  0.171072 -4.507651 1.81049
H  1.757401 -3.858566 1.396071
H  0.834878 -3.160133 2.727805
H  -4.428996 0.466267 0.735263
H  -1.356289 3.663612 1.44907
H  -0.320889 2.260047 1.13836
H  -0.954938 3.218146 -0.219756
H  -4.571251 -2.590756 -2.57204
H  -3.903259 -3.551322 -1.243514
H  -5.659485 -3.302363 -1.359881
totalener: -1726.36550502 hartree
nucrepener: 3037.06864796 hartree
electener: -4763.43415298 hartree
oneelecener: -8405.15682509 hartree
twoeener: 3641.72267210 hartree
kineticenergy: 1720.15647437 hartree
xcener: -141.534491771553 hartree
chargesum: -0.0000000
charge: 0.885669 -0.276541 -0.291318 -0.443921 -0.378497 -0.259305 -0.262374 -0.315936 -0.215612 -0.180092 -0.392263 -0.390837 0.072964 0.239438 -0.034272 -0.189084 -0.162962 -0.141577 0.019230 0.313875 0.309308 -0.246095 0.383838 0.378068 -0.295669 -0.087842 -0.123877 0.123645 0.121862 0.128279 0.128501 0.099583 0.070093 0.194847 0.168816 0.085648 0.103051 0.087583 0.128352 0.127028 0.054702 0.124962 0.109894 0.103902 0.124933
qa: 0.8857 -0.2765 -0.2913 -0.4439 -0.3785 -0.2593 -0.2624 -0.3159 -0.2156 -0.1801 -0.3923 -0.3908 0.0730 0.2394 -0.0343 -0.1891 -0.1630 -0.1416 0.0192 0.3139 0.3093 -0.2461 0.3838 0.3781 -0.2957 -0.0878 -0.1239 0.1236 0.1219 0.1283 0.1285 0.0996 0.0701 0.1948 0.1688 0.0856 0.1031 0.0876 0.1284 0.1270 0.0547 0.1250 0.1099 0.1039 0.1249
va: 6.0844 2.0710 2.0595 2.0370 2.1389 2.1558 2.1484 2.1990 3.0919 3.1432 2.9476 2.9383 3.9592 3.7961 3.9088 3.8696 3.9452 3.9480 3.8686 4.4414 4.2736 3.9614 4.0086 4.0482 3.9315 3.8635 3.8781 1.0147 1.0088 1.0013 0.9998 0.9957 0.9900 1.0850 1.0345 1.0089 1.0044 1.0052 1.0226 0.9991 1.0009 0.9983 0.9972 0.9967 0.9942
dispcorr: -0.030724766 hartree
energy: -1726.396229788520
dipole: -14.70495 11.94751 -2.75744 -12.46355 11.49438 -0.96917 14.31682 -12.73808 1.57874
magnitude: 3.32193 au
magnitude: 8.44367 debye
