program: Orca
programVersion: 4.2.1
elementType: S O O O O O O O N N N N C C C C C C C C C C C C C C C H H H H H H H H H H H H H H H H H H
charge: 0
multiplicity: 1
keywords: wb97x-d3
keywords: def2-TZVPP
keywords: def2/J RIJCOSX GRIDX6 NOFINALGRIDX
keywords: grid4 nofinalgrid
keywords: scfconv7
keywords: smallprint printgap noloewdin
keywords: NOSOSCF
formula: C15H18N4O7S
InChI: InChI=1S/C15H18N4O7S/c1-4-25-10-7-5-6-8-11(10)26-27(21,22)19-15(20)18-14-16-12(23-2)9-13(17-14)24-3/h5-9,18-19H,4H2,1-3H3
45 atoms
S  1.399029 0.01341 -0.023696
O  1.334027 -0.469886 -1.564896
O  3.967154 -0.18944 -1.55112
O  2.088307 -0.97283 0.754281
O  1.752337 1.406513 0.004481
O  -2.232705 3.708726 1.655411
O  -6.044877 1.193618 2.488659
O  -0.700004 -2.175739 0.025821
N  -0.223181 0.036866 0.323017
N  -2.324838 -0.817905 0.804105
N  -2.248311 1.467575 1.222446
N  -4.182863 0.183622 1.644579
C  2.124549 -1.524986 -1.984468
C  3.511631 -1.362952 -2.007582
C  1.527095 -2.688611 -2.413635
C  4.294575 -2.405748 -2.485109
C  2.31716 -3.720561 -2.90372
C  3.692499 -3.574913 -2.932934
C  5.324655 -0.076584 -1.168928
C  -1.032305 -1.06797 0.355812
C  -2.933212 0.334667 1.241738
C  5.496094 1.244298 -0.457024
C  -2.875938 2.557133 1.653757
C  -4.795484 1.278233 2.069876
C  -4.18578 2.527708 2.102478
C  -0.886169 3.745907 1.202073
C  -6.681666 -0.07431 2.472569
H  0.452695 -2.786453 -2.353271
H  5.371787 -2.315729 -2.515907
H  1.854969 -4.636587 -3.243809
H  4.314879 -4.377767 -3.304862
H  5.97446 -0.123609 -2.050768
H  5.598313 -0.908388 -0.51018
H  -0.633431 0.937314 0.595507
H  -2.910209 -1.639192 0.832203
H  4.862058 1.296215 0.426696
H  6.533533 1.361633 -0.144615
H  5.241429 2.079463 -1.10819
H  -4.696101 3.411187 2.45345
H  -0.797655 3.442782 0.158088
H  -0.573074 4.781567 1.298637
H  -0.232366 3.118455 1.809074
H  -7.684211 0.097166 2.855077
H  -6.742123 -0.484212 1.464142
H  -6.167099 -0.79345 3.11035
totalener: -1726.36948462 hartree
nucrepener: 2794.44497244 hartree
electener: -4520.81445706 hartree
oneelecener: -7921.22519774 hartree
twoeener: 3400.41074068 hartree
kineticenergy: 1720.15614990 hartree
xcener: -141.532570055297 hartree
chargesum: -0.0000000
charge: 0.884430 -0.296819 -0.302599 -0.397814 -0.446464 -0.260922 -0.262615 -0.377465 -0.211352 -0.169692 -0.430638 -0.406566 0.143982 0.289632 -0.085479 -0.183772 -0.158619 -0.135041 0.027048 0.347048 0.365571 -0.254531 0.397602 0.385101 -0.299325 -0.130068 -0.125690 0.116587 0.114316 0.123290 0.123904 0.078487 0.090640 0.197522 0.167814 0.095424 0.079217 0.087008 0.130138 0.111365 0.128259 0.108772 0.124625 0.108283 0.109407
qa: 0.8844 -0.2968 -0.3026 -0.3978 -0.4465 -0.2609 -0.2626 -0.3775 -0.2114 -0.1697 -0.4306 -0.4066 0.1440 0.2896 -0.0855 -0.1838 -0.1586 -0.1350 0.0270 0.3470 0.3656 -0.2545 0.3976 0.3851 -0.2993 -0.1301 -0.1257 0.1166 0.1143 0.1233 0.1239 0.0785 0.0906 0.1975 0.1678 0.0954 0.0792 0.0870 0.1301 0.1114 0.1283 0.1088 0.1246 0.1083 0.1094
va: 6.0577 2.0667 2.0939 2.0716 2.0504 2.1610 2.1517 2.1365 3.1132 3.1665 2.9751 2.9733 3.8592 3.9230 4.0121 3.9304 3.9869 3.9915 3.8744 4.4055 4.2436 3.9772 4.0215 4.0598 3.9369 3.8663 3.8749 1.0239 1.0117 1.0007 1.0002 0.9814 0.9895 1.0741 1.0361 1.0117 1.0066 1.0056 1.0214 0.9945 0.9963 0.9973 0.9939 0.9967 0.9967
dispcorr: -0.022504820 hartree
energy: -1726.391989442294
dipole: 9.48651 -10.47211 -0.98560 2.46248 -2.00787 0.45461 -1.05310 1.26913 0.21603
magnitude: 1.10668 au
magnitude: 2.81296 debye
