program: Orca
programVersion: 4.2.1
elementType: S O O O O O O O N N N N C C C C C C C C C C C C C C C H H H H H H H H H H H H H H H H H H
charge: 0
multiplicity: 1
keywords: wb97x-d3
keywords: def2-TZVPP
keywords: def2/J RIJCOSX GRIDX6 NOFINALGRIDX
keywords: grid4 nofinalgrid
keywords: scfconv7
keywords: smallprint printgap noloewdin
keywords: NOSOSCF
formula: C15H18N4O7S
InChI: InChI=1S/C15H18N4O7S/c1-4-25-10-7-5-6-8-11(10)26-27(21,22)19-15(20)18-14-16-12(23-2)9-13(17-14)24-3/h5-9,18-19H,4H2,1-3H3
45 atoms
S  2.77698 1.160742 -0.599713
O  2.677341 0.399624 0.839399
O  1.171772 -1.751131 0.900876
O  2.530822 2.563228 -0.38669
O  3.976117 0.661841 -1.184942
O  -2.290821 2.600097 -0.008565
O  -4.379717 -1.530732 -0.324015
O  2.066806 -1.417705 -2.189751
N  1.418508 0.635778 -1.386982
N  -0.133112 -1.015353 -1.889394
N  -1.198427 0.83304 -0.960844
N  -2.255339 -1.271803 -1.113875
C  1.480911 0.468506 1.521247
C  0.68454 -0.685182 1.544824
C  1.08803 1.618889 2.175772
C  -0.535983 -0.637161 2.210254
C  -0.131853 1.654129 2.840111
C  -0.939182 0.531197 2.844018
C  0.481432 -2.985233 0.97259
C  1.212205 -0.655939 -1.839561
C  -1.236005 -0.447979 -1.289923
C  1.31979 -4.027012 0.269699
C  -2.275634 1.331325 -0.362283
C  -3.327602 -0.757193 -0.529461
C  -3.402216 0.564088 -0.108999
C  -1.16847 3.417171 -0.312236
C  -4.323372 -2.88038 -0.755927
H  1.737708 2.483162 2.166557
H  -1.184485 -1.501805 2.237409
H  -0.44209 2.555638 3.349564
H  -1.895593 0.551555 3.348732
H  -0.505049 -2.898355 0.500474
H  0.320921 -3.266508 2.020155
H  0.567711 1.177791 -1.186807
H  -0.276684 -1.965048 -2.198933
H  2.281318 -4.155683 0.764453
H  0.801157 -4.985462 0.283644
H  1.511274 -3.753264 -0.766778
H  -4.280998 0.970607 0.367278
H  -1.424625 4.410107 0.046824
H  -0.266293 3.076041 0.195211
H  -0.980832 3.462068 -1.385809
H  -3.52962 -3.434465 -0.253194
H  -5.286102 -3.311949 -0.495655
H  -4.170153 -2.956149 -1.832753
totalener: -1726.36488506 hartree
nucrepener: 3074.96390659 hartree
electener: -4801.32879165 hartree
oneelecener: -8480.84502608 hartree
twoeener: 3679.51623443 hartree
kineticenergy: 1720.15313105 hartree
xcener: -141.533396261165 hartree
chargesum: 0.0000000
charge: 0.890863 -0.273785 -0.272640 -0.448600 -0.377148 -0.258990 -0.261929 -0.316615 -0.208013 -0.167999 -0.396440 -0.395742 0.069235 0.281302 -0.092225 -0.196651 -0.182818 -0.124550 -0.015512 0.292397 0.311878 -0.230806 0.406643 0.402016 -0.317226 -0.122560 -0.123314 0.144918 0.119534 0.131762 0.127280 0.068703 0.107228 0.197787 0.168151 0.092919 0.078012 0.088458 0.125605 0.129242 0.092834 0.120448 0.100158 0.126323 0.109871
qa: 0.8909 -0.2738 -0.2726 -0.4486 -0.3771 -0.2590 -0.2619 -0.3166 -0.2080 -0.1680 -0.3964 -0.3957 0.0692 0.2813 -0.0922 -0.1967 -0.1828 -0.1245 -0.0155 0.2924 0.3119 -0.2308 0.4066 0.4020 -0.3172 -0.1226 -0.1233 0.1449 0.1195 0.1318 0.1273 0.0687 0.1072 0.1978 0.1682 0.0929 0.0780 0.0885 0.1256 0.1292 0.0928 0.1204 0.1002 0.1263 0.1099
va: 6.0765 2.0725 2.1034 2.0324 2.1410 2.1441 2.1513 2.1891 3.0979 3.1517 2.9522 2.9267 3.8910 3.7959 3.8692 3.8924 3.8981 3.9269 3.8713 4.4450 4.2678 3.9642 3.9763 4.0157 3.9433 3.8581 3.8881 1.0103 1.0108 0.9987 1.0005 0.9850 0.9901 1.0810 1.0334 1.0088 1.0053 1.0204 1.0237 0.9960 0.9948 0.9957 0.9900 0.9943 0.9964
dispcorr: -0.032505374 hartree
energy: -1726.397390435442
dipole: -15.99980 12.85476 -3.14505 -12.48881 11.76029 -0.72852 7.28279 -6.41078 0.87201
magnitude: 3.34402 au
magnitude: 8.49982 debye
