program: Orca
programVersion: 4.2.1
elementType: Cl S O O O O O N N N N N N N C C C C C C C C C C C C C C C C H H H H H H H H H H H H H H H H H H
charge: 0
multiplicity: 1
keywords: wb97x-d3
keywords: def2-TZVPP
keywords: def2/J RIJCOSX GRIDX6 NOFINALGRIDX
keywords: grid4 nofinalgrid
keywords: scfconv7
keywords: smallprint printgap noloewdin
keywords: NOSOSCF
formula: C16H18ClN7O5S
InChI: InChI=1S/C16H18ClN7O5S/c1-4-5-9-6-7-10-18-13(17)14(24(10)22-9)30(26,27)23-16(25)21-15-19-11(28-2)8-12(20-15)29-3/h6-8,21,23H,4-5H2,1-3H3
48 atoms
Cl -5.169597 -0.258361 1.100954
S  -1.711604 -0.758108 1.811919
O  -2.684877 -1.739037 2.22765
O  -1.011865 0.031171 2.80574
O  -1.808004 -2.337092 -0.691444
O  4.62592 -1.641122 -2.733611
O  3.6406 -0.2163 1.572091
N  -1.830386 1.152777 -0.146458
N  -0.514916 1.250254 -0.265211
N  -4.00051 1.460029 -0.523552
N  -0.491512 -1.467833 0.945251
N  0.416148 -2.192807 -1.064826
N  2.514386 -1.923389 -1.903133
N  2.029602 -1.214472 0.29405
C  -2.501512 0.282087 0.672758
C  -0.082703 2.108817 -1.148455
C  1.402336 2.22124 -1.305983
C  -2.772789 1.841769 -0.857318
C  2.080025 2.868941 -0.098304
C  -0.962072 2.911668 -1.92476
C  -2.309041 2.783059 -1.787016
C  -3.83546 0.513301 0.394508
C  3.581713 2.99282 -0.292312
C  -0.706948 -2.021203 -0.293796
C  1.709859 -1.750418 -0.871368
C  3.761872 -1.50095 -1.744046
C  3.279092 -0.781888 0.434115
C  4.218553 -0.903355 -0.574526
C  4.193897 -2.236876 -3.955443
C  2.674971 -0.075348 2.612362
H  1.821695 1.224981 -1.471605
H  1.620183 2.80083 -2.204458
H  1.86568 2.279152 0.79587
H  1.646647 3.857111 0.07602
H  -0.544621 3.614621 -2.630943
H  -3.013533 3.363107 -2.365028
H  4.060743 3.401649 0.597809
H  4.039959 2.023566 -0.499495
H  3.819905 3.651745 -1.129265
H  0.237028 -2.606754 -1.97033
H  5.235202 -0.557134 -0.461129
H  5.06702 -2.242486 -4.601638
H  3.40257 -1.656175 -4.427963
H  3.852437 -3.260408 -3.806155
H  1.8424 0.559867 2.308628
H  3.197405 0.404164 3.434937
H  2.29777 -1.041705 2.946783
H  0.466494 -1.127675 1.127541
elementType: Cl S O N C H
totalener: -2238.49878518 hartree
nucrepener: 3618.19830200 hartree
electener: -5856.69708719 hartree
twoeener: 4410.96032581 hartree
cpcmener: -0.05374189 hartree
kineticenergy: 2231.43102729 hartree
xcener: -168.723714615598 hartree
chargesum: 0.0000000
charge: -0.017117 0.871379 -0.487653 -0.506621 -0.462227 -0.298533 -0.292066 0.228965 -0.332654 -0.320783 -0.203976 -0.124873 -0.419322 -0.386248 -0.156904 0.140145 -0.112404 0.212575 -0.110181 -0.089189 -0.142165 0.131756 -0.287997 0.345423 0.331297 0.458706 0.390525 -0.349481 -0.117195 -0.121357 0.074510 0.102328 0.082026 0.091583 0.157385 0.162753 0.096481 0.080754 0.095271 0.195022 0.150609 0.133757 0.115119 0.115396 0.086675 0.143269 0.130684 0.214555
qa: -0.0171 0.8714 -0.4877 -0.5066 -0.4622 -0.2985 -0.2921 0.2290 -0.3327 -0.3208 -0.2040 -0.1249 -0.4193 -0.3862 -0.1569 0.1401 -0.1124 0.2126 -0.1102 -0.0892 -0.1422 0.1318 -0.2880 0.3454 0.3313 0.4587 0.3905 -0.3495 -0.1172 -0.1214 0.0745 0.1023 0.0820 0.0916 0.1574 0.1628 0.0965 0.0808 0.0953 0.1950 0.1506 0.1338 0.1151 0.1154 0.0867 0.1433 0.1307 0.2146
va: 1.3060 5.8853 2.0080 1.9696 2.0468 2.1291 2.1136 3.4038 2.8698 3.1309 3.0663 3.1830 2.9516 2.9504 3.8089 3.9369 3.8821 3.9836 3.8486 3.9083 4.0513 4.2580 3.9399 4.4213 4.2622 3.9638 3.9566 3.8988 3.8456 3.8399 1.0237 1.0162 1.0028 1.0105 0.9936 1.0000 1.0038 0.9942 1.0020 1.0146 1.0150 0.9935 0.9952 0.9949 0.9931 0.9960 0.9911 1.0766
dispcorr: -0.031670125 hartree
energy: -2238.530455305377
dipole: 45.88707 -41.32402 4.56305 15.52188 -13.07015 2.45174 -13.77450 10.32714 -3.44735
magnitude: 6.22227 au
magnitude: 15.81576 debye
