program: Orca
programVersion: 4.2.1
elementType: Cl S O O O O O N N N N N N N C C C C C C C C C C C C C C C C H H H H H H H H H H H H H H H H H H
charge: 0
multiplicity: 1
keywords: wb97x-d3
keywords: def2-TZVPP
keywords: def2/J RIJCOSX GRIDX6 NOFINALGRIDX
keywords: grid4 nofinalgrid
keywords: scfconv7
keywords: smallprint printgap noloewdin
keywords: NOSOSCF
formula: C16H18ClN7O5S
InChI: InChI=1S/C16H18ClN7O5S/c1-4-5-9-6-7-10-18-13(17)14(24(10)22-9)30(26,27)23-16(25)21-15-19-11(28-2)8-12(20-15)29-3/h6-8,21,23H,4-5H2,1-3H3
48 atoms
Cl -4.7200 -0.788478 -1.875735
S  -2.055102 -1.315444 0.451435
O  -2.751255 -2.42015 -0.163992
O  -1.982203 -1.218595 1.894794
O  -0.893648 -1.20836 -2.255065
O  2.911607 -1.291099 2.733905
O  5.753216 -0.77458 -0.900171
N  -2.228863 1.379677 0.073295
N  -1.206109 1.645035 0.871998
N  -3.893244 1.663141 -1.374282
N  -0.470081 -1.28228 -0.026347
N  1.257312 -1.130896 -1.567072
N  2.063184 -1.218967 0.611851
N  3.500016 -0.951352 -1.241094
C  -2.718208 0.132287 -0.217786
C  -0.884417 2.904364 0.985393
C  0.258017 3.243228 1.89557
C  -2.966666 2.276288 -0.645328
C  1.449674 2.29582 1.810021
C  -1.589906 3.935674 0.305607
C  -2.633533 3.631415 -0.510352
C  -3.734996 0.367775 -1.124435
C  2.122507 2.298224 0.446661
C  -0.095295 -1.212925 -1.341671
C  2.31377 -1.097242 -0.680945
C  3.108998 -1.174082 1.43144
C  4.533351 -0.912088 -0.411144
C  4.403415 -1.013878 0.969721
C  1.591198 -1.526253 3.218339
C  5.928726 -0.681814 -2.312773
H  0.582065 4.262486 1.677288
H  -0.124759 3.262471 2.92034
H  1.133676 1.284379 2.069394
H  2.168739 2.597221 2.573919
H  -1.280124 4.961371 0.444374
H  -3.191479 4.38216 -1.050645
H  3.032429 1.696546 0.456985
H  1.47062 1.900432 -0.332779
H  2.409481 3.308802 0.150265
H  1.51185 -1.055923 -2.543228
H  5.254348 -0.982974 1.633993
H  0.923935 -0.69094 3.003085
H  1.686671 -1.623444 4.295789
H  1.170619 -2.447211 2.815021
H  7.000165 -0.593964 -2.468489
H  5.433654 0.197585 -2.722858
H  5.565203 -1.572852 -2.823016
H  0.270096 -1.239488 0.688584
elementType: Cl S O N C H
totalener: -2238.49924959 hartree
nucrepener: 3593.68411320 hartree
electener: -5832.18336278 hartree
twoeener: 4387.14907287 hartree
cpcmener: -0.05327312 hartree
kineticenergy: 2231.43631356 hartree
xcener: -168.728234614620 hartree
chargesum: -0.0000000
charge: -0.018306 0.874450 -0.489714 -0.508897 -0.473278 -0.293987 -0.298786 0.236515 -0.333877 -0.320965 -0.200003 -0.123586 -0.400238 -0.414205 -0.197758 0.113869 -0.109346 0.217059 -0.044592 -0.077835 -0.154009 0.170631 -0.307649 0.375831 0.327572 0.391862 0.415398 -0.304987 -0.119399 -0.115642 0.093019 0.103746 0.026889 0.087310 0.155665 0.162793 0.089984 0.082361 0.106784 0.193456 0.145484 0.100544 0.142050 0.123686 0.133327 0.115326 0.114432 0.207015
qa: -0.0183 0.8744 -0.4897 -0.5089 -0.4733 -0.2940 -0.2988 0.2365 -0.3339 -0.3210 -0.2000 -0.1236 -0.4002 -0.4142 -0.1978 0.1139 -0.1093 0.2171 -0.0446 -0.0778 -0.1540 0.1706 -0.3076 0.3758 0.3276 0.3919 0.4154 -0.3050 -0.1194 -0.1156 0.0930 0.1037 0.0269 0.0873 0.1557 0.1628 0.0900 0.0824 0.1068 0.1935 0.1455 0.1005 0.1421 0.1237 0.1333 0.1153 0.1144 0.2070
va: 1.3031 5.8864 2.0123 1.9702 2.0445 2.1213 2.1251 3.4139 2.8601 3.1282 3.0699 3.1846 2.9260 2.9512 3.8360 3.9425 3.9057 3.9806 3.8520 3.8993 4.0503 4.2155 3.9515 4.3939 4.2617 3.9750 4.0153 3.9208 3.8452 3.8458 1.0068 1.0082 1.0255 1.0106 0.9918 1.0003 1.0081 0.9994 1.0044 1.0164 1.0173 0.9837 0.9961 0.9911 0.9934 0.9950 0.9957 1.0724
dispcorr: -0.031181829 hartree
energy: -2238.530431415189
dipole: 40.31027 -36.03175 4.27852 17.54099 -13.85516 3.68583 13.02404 -12.01258 1.01146
magnitude: 5.73708 au
magnitude: 14.58249 debye
