program: Orca
programVersion: 4.2.1
elementType: Cl S O O O O O N N N N N N N C C C C C C C C C C C C C C C C H H H H H H H H H H H H H H H H H H
charge: 0
multiplicity: 1
keywords: wb97x-d3
keywords: def2-TZVPP
keywords: def2/J RIJCOSX GRIDX6 NOFINALGRIDX
keywords: grid4 nofinalgrid
keywords: scfconv7
keywords: smallprint printgap noloewdin
keywords: NOSOSCF
formula: C16H18ClN7O5S
InChI: InChI=1S/C16H18ClN7O5S/c1-4-5-9-6-7-10-18-13(17)14(24(10)22-9)30(26,27)23-16(25)21-15-19-11(28-2)8-12(20-15)29-3/h6-8,21,23H,4-5H2,1-3H3
48 atoms
Cl -5.005533 -0.155219 1.443669
S  -2.067244 -1.621473 0.011321
O  -1.885224 -2.020436 -1.369051
O  -2.921611 -2.389271 0.883437
O  -1.079185 -0.730178 2.649087
O  2.953638 -1.856976 -2.014176
O  5.542164 0.006048 1.359128
N  -1.922535 1.056794 -0.484057
N  -0.74005 0.966137 -1.074283
N  -3.775982 1.923853 0.383334
N  -0.522496 -1.561761 0.608769
N  1.10385 -0.775555 2.066804
N  2.019361 -1.36155 0.01205
N  3.322232 -0.398299 1.727408
C  -2.615715 0.01935 0.082811
C  -0.231395 2.086876 -1.508115
C  1.138607 2.009714 -2.102918
C  -2.655203 2.190869 -0.278136
C  2.241178 2.246494 -1.063663
C  -0.913467 3.330145 -1.388154
C  -2.124741 3.391215 -0.773323
C  -3.747599 0.613648 0.608029
C  2.254691 3.641857 -0.460783
C  -0.229896 -1.006033 1.828712
C  2.191777 -0.85431 1.220678
C  3.082981 -1.385872 -0.785368
C  4.377222 -0.441492 0.924264
C  4.323819 -0.932171 -0.375515
C  1.667707 -2.289721 -2.455346
C  5.629763 0.554327 2.673295
H  1.274625 1.024438 -2.551003
H  1.22843 2.744693 -2.905426
H  3.199162 2.04978 -1.548708
H  2.142509 1.50734 -0.265565
H  -0.45586 4.221748 -1.792279
H  -2.67408 4.313778 -0.654978
H  2.328974 4.409885 -1.232714
H  1.359931 3.846899 0.12889
H  3.109663 3.761613 0.205171
H  1.298453 -0.378182 2.976531
H  5.188173 -0.950636 -1.022636
H  1.803654 -2.613569 -3.483125
H  0.939993 -1.477619 -2.436647
H  1.300393 -3.129825 -1.865769
H  4.98422 1.424192 2.78947
H  6.665243 0.859912 2.793066
H  5.383604 -0.183427 3.435954
H  0.257844 -1.646666 -0.060969
elementType: Cl S O N C H
totalener: -2238.49939511 hartree
nucrepener: 3611.97027786 hartree
electener: -5850.46967297 hartree
twoeener: 4404.78209806 hartree
cpcmener: -0.05345746 hartree
kineticenergy: 2231.42965502 hartree
xcener: -168.724669061224 hartree
chargesum: 0.0000000
charge: -0.017291 0.873231 -0.506120 -0.486420 -0.467884 -0.296603 -0.298335 0.234495 -0.329592 -0.320917 -0.209819 -0.125321 -0.396016 -0.416869 -0.180144 0.167884 -0.149744 0.215092 -0.073242 -0.135468 -0.138241 0.153051 -0.304718 0.363489 0.328634 0.414687 0.427441 -0.331734 -0.112115 -0.114392 0.106020 0.114958 0.091518 0.032708 0.167344 0.162885 0.097171 0.089156 0.098939 0.194165 0.143950 0.141088 0.086294 0.124901 0.113718 0.133466 0.114778 0.219922
qa: -0.0173 0.8732 -0.5061 -0.4864 -0.4679 -0.2966 -0.2983 0.2345 -0.3296 -0.3209 -0.2098 -0.1253 -0.3960 -0.4169 -0.1801 0.1679 -0.1497 0.2151 -0.0732 -0.1355 -0.1382 0.1531 -0.3047 0.3635 0.3286 0.4147 0.4274 -0.3317 -0.1121 -0.1144 0.1060 0.1150 0.0915 0.0327 0.1673 0.1629 0.0972 0.0892 0.0989 0.1942 0.1439 0.1411 0.0863 0.1249 0.1137 0.1335 0.1148 0.2199
va: 1.3045 5.8905 1.9736 2.0130 2.0441 2.1199 2.1242 3.4006 2.8764 3.1302 3.0728 3.1834 2.9474 2.9443 3.8200 3.8769 3.8947 3.9865 3.8727 3.9081 4.0510 4.2348 3.9541 4.4077 4.2522 3.9576 3.9894 3.9116 3.8388 3.8468 1.0116 1.0076 1.0046 1.0151 0.9855 1.0000 0.9982 0.9943 1.0061 1.0153 1.0181 0.9967 0.9977 0.9920 0.9951 0.9935 0.9951 1.0666
dispcorr: -0.031416641 hartree
energy: -2238.530811748571
dipole: 43.60475 -38.71191 4.89284 18.48099 -15.09258 3.38841 -11.23018 9.56840 -1.66178
magnitude: 6.17922 au
magnitude: 15.70633 debye
