program: Orca
programVersion: 4.2.1
elementType: Cl S O O O O O N N N N N N N C C C C C C C C C C C C C C C C H H H H H H H H H H H H H H H H H H
charge: 0
multiplicity: 1
keywords: wb97x-d3
keywords: def2-TZVPP
keywords: def2/J RIJCOSX GRIDX6 NOFINALGRIDX
keywords: grid4 nofinalgrid
keywords: scfconv7
keywords: smallprint printgap noloewdin
keywords: NOSOSCF
formula: C16H18ClN7O5S
InChI: InChI=1S/C16H18ClN7O5S/c1-4-5-9-6-7-10-18-13(17)14(24(10)22-9)30(26,27)23-16(25)21-15-19-11(28-2)8-12(20-15)29-3/h6-8,21,23H,4-5H2,1-3H3
48 atoms
Cl -5.024705 -0.148503 1.395076
S  -2.073228 -1.62094 0.003157
O  -1.893375 -2.017509 -1.378321
O  -2.936439 -2.387247 0.867967
O  -1.080453 -0.758996 2.652141
O  2.93055 -1.889129 -2.026358
O  5.529613 0.019181 1.313049
N  -1.90761 1.058439 -0.481511
N  -0.715473 0.966664 -1.052219
N  -3.77673 1.927832 0.350585
N  -0.529933 -1.575786 0.603313
N  1.099949 -0.785767 2.056316
N  2.008004 -1.383912 0.002983
N  3.315492 -0.398469 1.701809
C  -2.610288 0.022885 0.077626
C  -0.202677 2.085985 -1.485654
C  1.17702 2.011307 -2.05807
C  -2.6448 2.192762 -0.292744
C  2.259498 2.263175 -1.00076
C  -0.889016 3.32845 -1.383776
C  -2.109048 3.391082 -0.786666
C  -3.751464 0.6186 0.580497
C  2.261871 3.66844 -0.420694
C  -0.233736 -1.024398 1.82485
C  2.18446 -0.865175 1.205921
C  3.065674 -1.407726 -0.802242
C  4.364425 -0.439911 0.89069
C  4.306106 -0.942841 -0.404235
C  1.644851 -2.335574 -2.454637
C  5.621565 0.591243 2.616525
H  1.326416 1.024782 -2.499001
H  1.27477 2.741688 -2.863793
H  3.227083 2.057446 -1.462692
H  2.143155 1.538449 -0.19176
H  -0.427427 4.218015 -1.787836
H  -2.660865 4.313811 -0.681197
H  1.358014 3.882176 0.151973
H  3.106714 3.800625 0.256147
H  2.346803 4.423713 -1.204133
H  1.296506 -0.386682 2.965033
H  5.165931 -0.959205 -1.057455
H  1.780678 -2.688881 -3.472948
H  0.91708 -1.523051 -2.45909
H  1.278055 -3.158852 -1.841291
H  5.393747 -0.137125 3.394398
H  4.964028 1.453645 2.724438
H  6.653579 0.914302 2.721577
H  0.249266 -1.65846 -0.068106
elementType: Cl S O N C H
totalener: -2238.49944890 hartree
nucrepener: 3613.16633972 hartree
electener: -5851.66578863 hartree
twoeener: 4405.93785888 hartree
cpcmener: -0.05379333 hartree
kineticenergy: 2231.42178442 hartree
xcener: -168.723253072517 hartree
chargesum: -0.0000000
charge: -0.017291 0.872108 -0.506448 -0.486971 -0.468294 -0.296683 -0.298409 0.235643 -0.329467 -0.320920 -0.209133 -0.124275 -0.393630 -0.414908 -0.177596 0.167361 -0.142178 0.216044 -0.087434 -0.136854 -0.138992 0.149914 -0.305511 0.363156 0.323441 0.415460 0.423370 -0.328357 -0.111674 -0.114179 0.104312 0.115664 0.091153 0.044754 0.167521 0.162841 0.089035 0.098953 0.096956 0.194386 0.143661 0.141084 0.088308 0.123025 0.114760 0.113365 0.133406 0.219520
qa: -0.0173 0.8721 -0.5064 -0.4870 -0.4683 -0.2967 -0.2984 0.2356 -0.3295 -0.3209 -0.2091 -0.1243 -0.3936 -0.4149 -0.1776 0.1674 -0.1422 0.2160 -0.0874 -0.1369 -0.1390 0.1499 -0.3055 0.3632 0.3234 0.4155 0.4234 -0.3284 -0.1117 -0.1142 0.1043 0.1157 0.0912 0.0448 0.1675 0.1628 0.0890 0.0990 0.0970 0.1944 0.1437 0.1411 0.0883 0.1230 0.1148 0.1134 0.1334 0.2195
va: 1.3045 5.8922 1.9730 2.0119 2.0437 2.1206 2.1227 3.3982 2.8774 3.1300 3.0711 3.1836 2.9489 2.9411 3.8194 3.8793 3.8869 3.9847 3.8806 3.9103 4.0511 4.2380 3.9574 4.4078 4.2577 3.9586 3.9933 3.9076 3.8393 3.8474 1.0130 1.0072 1.0037 1.0098 0.9852 1.0000 0.9945 1.0059 0.9982 1.0152 1.0181 0.9966 0.9977 0.9920 0.9949 0.9951 0.9934 1.0676
dispcorr: -0.031479304 hartree
energy: -2238.530928205195
dipole: 43.71850 -38.78698 4.93152 18.57731 -15.16424 3.41307 -10.90582 9.25411 -1.65171
magnitude: 6.22069 au
magnitude: 15.81175 debye
