program: Orca
programVersion: 4.2.1
elementType: Cl S O O O O O N N N N N N N C C C C C C C C C C C C C C C C H H H H H H H H H H H H H H H H H H
charge: 0
multiplicity: 1
keywords: wb97x-d3
keywords: def2-TZVPP
keywords: def2/J RIJCOSX GRIDX6 NOFINALGRIDX
keywords: grid4 nofinalgrid
keywords: scfconv7
keywords: smallprint printgap noloewdin
keywords: NOSOSCF
formula: C16H18ClN7O5S
InChI: InChI=1S/C16H18ClN7O5S/c1-4-5-9-6-7-10-18-13(17)14(24(10)22-9)30(26,27)23-16(25)21-15-19-11(28-2)8-12(20-15)29-3/h6-8,21,23H,4-5H2,1-3H3
48 atoms
Cl -5.025556 -0.147497 1.315534
S  -2.089829 -1.619215 -0.108973
O  -1.902211 -2.007447 -1.491982
O  -2.959552 -2.388543 0.748422
O  -1.115627 -0.765074 2.545793
O  2.934619 -1.885704 -2.10074
O  5.523966 -0.08427 1.304607
N  -1.910738 1.06563 -0.561477
N  -0.723417 0.973365 -1.142643
N  -3.761433 1.936386 0.308168
N  -0.550761 -1.585924 0.503027
N  1.069439 -0.807717 1.972895
N  1.993352 -1.392745 -0.077784
N  3.296074 -0.460614 1.654288
C  -2.621875 0.024325 -0.022797
C  -0.199595 2.097006 -1.550628
C  1.175489 2.022177 -2.132885
C  -2.631903 2.203162 -0.338282
C  2.268233 2.23114 -1.077395
C  -0.870528 3.34456 -1.413439
C  -2.085076 3.407257 -0.805996
C  -3.750254 0.62189 0.5060
C  2.286499 3.614194 -0.447006
C  -0.262521 -1.036641 1.727738
C  2.16347 -0.897044 1.135741
C  3.061854 -1.425808 -0.868289
C  4.355939 -0.511576 0.857979
C  4.305524 -0.991642 -0.44568
C  1.647226 -2.304656 -2.551782
C  5.611009 0.446689 2.62531
H  1.311245 1.04612 -2.600744
H  1.277452 2.774056 -2.918022
H  3.230054 2.036005 -1.555264
H  2.155188 1.478105 -0.294421
H  -0.400851 4.238506 -1.7980
H  -2.624194 4.333902 -0.674075
H  1.388676 3.814549 0.139519
H  3.136824 3.713708 0.228165
H  2.373169 4.39702 -1.202582
H  1.259371 -0.416523 2.886298
H  5.174342 -1.016897 -1.086534
H  1.265168 -3.13831 -1.962656
H  1.788454 -2.633155 -3.577248
H  0.929668 -1.483442 -2.54177
H  4.977318 1.324312 2.748386
H  6.649899 0.735933 2.755491
H  5.349348 -0.296517 3.377415
H  0.2325 -1.659444 -0.164826
elementType: Cl S O N C H
totalener: -2238.49937130 hartree
nucrepener: 3613.59013182 hartree
electener: -5852.08950313 hartree
twoeener: 4406.39064888 hartree
cpcmener: -0.05370066 hartree
kineticenergy: 2231.43477111 hartree
xcener: -168.725696578605 hartree
chargesum: -0.0000000
charge: -0.017334 0.872873 -0.506623 -0.488062 -0.467436 -0.296248 -0.298187 0.234721 -0.331036 -0.320913 -0.209480 -0.123109 -0.394974 -0.416360 -0.179174 0.168843 -0.146778 0.215874 -0.073493 -0.136314 -0.138354 0.153502 -0.304785 0.361615 0.326511 0.414907 0.426208 -0.330414 -0.112131 -0.114401 0.104631 0.114791 0.091534 0.032554 0.167112 0.163050 0.089108 0.098976 0.097173 0.194360 0.143701 0.124087 0.141220 0.087464 0.113485 0.133479 0.114724 0.219107
qa: -0.0173 0.8729 -0.5066 -0.4881 -0.4674 -0.2962 -0.2982 0.2347 -0.3310 -0.3209 -0.2095 -0.1231 -0.3950 -0.4164 -0.1792 0.1688 -0.1468 0.2159 -0.0735 -0.1363 -0.1384 0.1535 -0.3048 0.3616 0.3265 0.4149 0.4262 -0.3304 -0.1121 -0.1144 0.1046 0.1148 0.0915 0.0326 0.1671 0.1630 0.0891 0.0990 0.0972 0.1944 0.1437 0.1241 0.1412 0.0875 0.1135 0.1335 0.1147 0.2191
va: 1.3043 5.8904 1.9729 2.0109 2.0444 2.1212 2.1238 3.3986 2.8759 3.1301 3.0726 3.1838 2.9476 2.9443 3.8189 3.8769 3.8946 3.9861 3.8749 3.9083 4.0504 4.2353 3.9547 4.4084 4.2534 3.9581 3.9906 3.9103 3.8388 3.8472 1.0122 1.0076 1.0046 1.0139 0.9855 0.9999 0.9943 1.0060 0.9982 1.0152 1.0181 0.9920 0.9966 0.9976 0.9951 0.9934 0.9951 1.0679
dispcorr: -0.031465632 hartree
energy: -2238.530836936640
dipole: 43.88325 -38.92512 4.95813 18.24218 -14.85298 3.38920 -10.50921 8.93414 -1.57507
magnitude: 6.20891 au
magnitude: 15.78180 debye
