program: Orca
programVersion: 4.2.1
elementType: Cl S O O O O O N N N N N N N C C C C C C C C C C C C C C C C H H H H H H H H H H H H H H H H H H
charge: 0
multiplicity: 1
keywords: wb97x-d3
keywords: def2-TZVPP
keywords: def2/J RIJCOSX GRIDX6 NOFINALGRIDX
keywords: grid4 nofinalgrid
keywords: scfconv7
keywords: smallprint printgap noloewdin
keywords: NOSOSCF
formula: C16H18ClN7O5S
InChI: InChI=1S/C16H18ClN7O5S/c1-4-5-9-6-7-10-18-13(17)14(24(10)22-9)30(26,27)23-16(25)21-15-19-11(28-2)8-12(20-15)29-3/h6-8,21,23H,4-5H2,1-3H3
48 atoms
Cl -4.893414 -0.33219 1.548948
S  -2.039706 -1.522062 -0.250224
O  -1.832971 -1.802092 -1.656587
O  -2.848497 -2.408587 0.552316
O  -1.124754 -0.755155 2.444547
O  3.08248 -1.86245 -2.068739
O  5.607444 -0.428252 1.552985
N  -2.089857 1.183878 -0.58431
N  -0.972794 1.201839 -1.302294
N  -3.877503 1.880513 0.538673
N  -0.505596 -1.417828 0.36276
N  1.077778 -0.796361 1.941197
N  2.064794 -1.349328 -0.088053
N  3.337274 -0.607522 1.755412
C  -2.678045 0.068808 -0.043441
C  -0.573369 2.379843 -1.694671
C  0.695078 2.460769 -2.480979
C  -2.845743 2.256154 -0.208618
C  1.825713 3.134281 -1.696307
C  -1.289569 3.572755 -1.389654
C  -2.425943 3.520977 -0.648317
C  -3.769332 0.560196 0.647278
C  2.322112 2.304613 -0.523885
C  -0.249006 -0.979181 1.635713
C  2.2047 -0.925154 1.156112
C  3.173352 -1.456616 -0.813766
C  4.435223 -0.728079 1.021381
C  4.423077 -1.158054 -0.300898
C  1.791103 -2.115758 -2.619225
C  5.662692 0.026745 2.90373
H  0.998362 1.458203 -2.787344
H  0.498723 3.0325 -3.390921
H  1.500276 4.118706 -1.349647
H  2.650931 3.316953 -2.386924
H  -0.917431 4.518017 -1.758972
H  -2.998839 4.400516 -0.393377
H  2.737258 1.35853 -0.873118
H  3.110324 2.826375 0.01914
H  1.528364 2.08081 0.190885
H  1.245545 -0.472134 2.884603
H  5.324868 -1.247025 -0.888342
H  1.964612 -2.422504 -3.646462
H  1.17257 -1.217164 -2.621201
H  1.277387 -2.920226 -2.092963
H  6.714899 0.201162 3.109712
H  5.281605 -0.721585 3.597539
H  5.112727 0.957554 3.037749
H  0.294445 -1.507912 -0.280667
elementType: Cl S O N C H
totalener: -2238.50083047 hartree
nucrepener: 3588.11916943 hartree
electener: -5826.61999990 hartree
twoeener: 4381.36964657 hartree
cpcmener: -0.05381572 hartree
kineticenergy: 2231.43476598 hartree
xcener: -168.725526766165 hartree
chargesum: -0.0000000
charge: -0.018423 0.873234 -0.509039 -0.489465 -0.470791 -0.295727 -0.297825 0.231695 -0.316163 -0.320192 -0.206536 -0.123851 -0.396902 -0.411877 -0.194309 0.099396 -0.125257 0.224940 -0.102502 -0.071779 -0.165702 0.168282 -0.260652 0.370049 0.322248 0.395343 0.413914 -0.302333 -0.111118 -0.115317 0.099209 0.115802 0.073101 0.079275 0.160477 0.162758 0.064187 0.102407 0.081266 0.193731 0.145439 0.140885 0.089840 0.118950 0.133514 0.114671 0.114152 0.216995
qa: -0.0184 0.8732 -0.5090 -0.4895 -0.4708 -0.2957 -0.2978 0.2317 -0.3162 -0.3202 -0.2065 -0.1239 -0.3969 -0.4119 -0.1943 0.0994 -0.1253 0.2249 -0.1025 -0.0718 -0.1657 0.1683 -0.2607 0.3700 0.3222 0.3953 0.4139 -0.3023 -0.1111 -0.1153 0.0992 0.1158 0.0731 0.0793 0.1605 0.1628 0.0642 0.1024 0.0813 0.1937 0.1454 0.1409 0.0898 0.1189 0.1335 0.1147 0.1142 0.2170
va: 1.3028 5.8880 1.9709 2.0113 2.0455 2.1259 2.1246 3.4022 2.8534 3.1285 3.0718 3.1861 2.9412 2.9404 3.8303 3.9463 3.8957 3.9776 3.8977 3.8771 4.0652 4.2189 3.9363 4.4002 4.2633 3.9879 4.0092 3.9057 3.8445 3.8465 1.0064 1.0041 1.0099 1.0088 0.9900 1.0008 1.0034 1.0043 1.0012 1.0159 1.0169 0.9964 0.9924 0.9943 0.9933 0.9953 0.9951 1.0652
dispcorr: -0.030506574 hartree
energy: -2238.531337041369
dipole: 42.38828 -37.79339 4.59489 17.12218 -13.55716 3.56503 -11.98512 10.49298 -1.49214
magnitude: 6.00408 au
magnitude: 15.26115 debye
