program: Gaussian 09
title: 000069057
version: EM64L-G09RevD.01
frameworkgroup: C1[X(C14H6N2O6)]
method: RPBEPBE
basis: SDD
operation: Freq
keyword: #p
keyword: freq=noraman
keyword: PBEPBE/SDD
title: #p freq=noraman PBEPBE/SDD
converged: YES YES YES YES
title: Mulliken charges:
elementType: O O O O O O N N C C C C C C C C C C C C C C H H H H H H
charge: -0.163194 -0.166279 -0.188467 -0.188466 -0.179451 -0.179450 0.025508 0.025505 0.281700 0.281700 0.285611 0.285618 -0.190381 -0.196208 -0.495120 -0.495130 -0.345112 -0.345112 0.406268 0.406280 -0.376980 -0.376986 0.341347 0.341346 0.300875 0.300875 0.301854 0.301852
chargesum: 0.00000
title: Mulliken charges with hydrogens summed into heavy atoms:
elementType: O O O O O O N N C C C C C C C C C C C C C C
charge: -0.163194 -0.166279 -0.188467 -0.188466 -0.179451 -0.179450 0.025508 0.025505 0.281700 0.281700 0.285611 0.285618 -0.190381 -0.196208 -0.153773 -0.153784 -0.044236 -0.044237 0.406268 0.406280 -0.075126 -0.075134
polarizability: 3.35077363e+02 1.37980921e-04 2.16634004e+02 3.95066679e-03 -5.23195127e-03 6.65262075e+01
1716.lowfreq: -7.6029 -5.6403 -0.0012 -0.0005 0.0007 3.5280 30.8213 44.7141 51.4278
frequency: 30.8123 44.7135 51.4272 74.7356 92.1486 99.3583 146.8695 157.3858 164.0719 222.6860 233.8081 275.3774 289.6148 296.1483 313.8984 395.2765 410.2923 443.5922 446.9692 449.2096 480.5162 501.1410 506.0652 513.4883 517.5239 631.8548 634.3022 654.3224 683.4678 688.1407 694.7104 696.3184 734.2037 739.5623 767.3228 774.9316 860.5222 861.8696 883.2465 918.0596 923.3853 979.1090 983.3222 995.0824 1018.8002 1021.4050 1058.8493 1070.0472 1110.2124 1112.7716 1156.1460 1173.0921 1204.1204 1213.9352 1217.4538 1249.8717 1262.7708 1302.6199 1374.4710 1378.2009 1401.7361 1406.9791 1421.5112 1432.5679 1462.1858 1463.4874 1546.8094 1557.0224 1576.3847 1603.7072 1603.9916 1621.2057 3165.9357 3166.4592 3177.5147 3178.2026 3188.1596 3188.4472
redmass: 12.5610 13.6135 15.0791 7.0922 10.4849 13.0653 6.2892 5.2220 11.9590 8.1673 11.3566 8.3425 6.6748 12.1349 10.9840 8.9375 3.4068 11.4656 6.8960 3.2887 10.1855 7.4033 8.9635 5.5117 7.4563 5.9160 7.5422 7.1326 8.9156 6.9244 3.8814 7.0121 4.0943 10.4279 8.1169 11.1943 1.8887 7.6896 1.3907 6.9405 2.5250 1.4208 4.1681 1.6646 1.3603 1.3871 2.2460 2.0609 2.5632 1.7478 1.6055 4.3190 5.5236 11.7969 2.0380 1.3876 2.0031 4.8741 8.1306 12.2286 9.8622 5.4899 9.9067 5.9105 2.9063 2.7947 11.8445 10.0253 8.5538 9.6469 7.0360 8.0892 1.0904 1.0904 1.0925 1.0925 1.0961 1.0962
irintensity: 0.0097 0.0000 0.0721 0.0000 14.3490 1.8795 1.4256 0.0000 1.0156 1.4056 0.0175 3.5422 0.0000 0.0881 3.9641 22.7788 1.4477 0.0875 0.7319 0.0000 12.8865 2.2404 1.5611 0.0001 11.1351 0.1165 1.1301 5.6083 19.9361 0.0005 67.4636 0.0000 0.0000 7.5621 6.5355 50.0940 15.7710 4.6826 0.0000 45.8973 52.8587 0.0000 27.8428 26.9350 0.0000 0.2009 4.6613 85.2736 1.2221 12.0686 35.6883 3.6778 552.1649 61.7834 105.3795 8.8311 11.6949 445.0705 133.9288 79.1009 0.5092 24.3725 7.9503 1.4905 15.9434 2.9815 5.8815 227.1745 0.0655 1.4986 9.0715 7.9482 5.6503 0.8629 0.2798 23.8840 3.5760 0.1668
temp: 298.150 k
press: 1.00000 atm
elementType: 8 8 8 8 8 8 7 7 6 6 6 6 6 6 6 6 6 6 6 6 6 6 1 1 1 1 1 1
symmnumber: 1
zpe: 468624.7 jmol-1
zpe.correction: 0.178490 hartree
zpe.thermalcorrener: 0.195343 hartree
zpe.thermalcorrenthalpy: 0.196287 hartree
zpe.thermalcorrgfe: 0.132303 hartree
zpe.sumelectzpe: -1096.285374 hartree
zpe.sumelectthermal: -1096.268521 hartree
zpe.sumelectthermalent: -1096.267577 hartree
zpe.sumelectthermalfe: -1096.331561 hartree
dipole: 0.0002 4.5550 0.0008
dipole: 4.5550
quadrupole: -163.9863 -137.1013 -121.2782
quadrupole: -0.0003 0.0006 -0.0029
quadrupole: -23.1977 3.6873 19.5104 -0.0003 0.0006 -0.0029
hfenergy: -1096.4638638 hartree
pointgroup: C01 [X(C14H6N2O6)]
dipole: -0.0000455 1.7920941 -0.0003132 debye
polarizability: 335.077363|-0.0010945|216.6340037|0.0039507|0.0052319|66.5262075 unknown
InChI: InChI=1S/C14H6N2O6/c17-13-9-3-1-7(15(19)20)5-11(9)14(18)12-6-8(16(21)22)2-4-10(12)13/h1-6H
charge 0 multiplicity 1
28 atoms
O  -0.000015 -2.316519 0.000105
O  0.000009 3.199575 -0.000016
O  -6.084534 -0.291991 0.000336
O  6.084555 -0.292105 0.000336
O  -4.954652 -2.274932 -0.00011
O  4.954669 -2.274987 0.000274
N  -4.999303 -0.988221 -0.000132
N  4.999303 -0.988285 0.000152
C  -1.279886 -0.270909 -0.000098
C  1.279876 -0.270921 -0.000025
C  -1.28137 1.155431 0.000024
C  1.281371 1.155418 0.000087
C  -0.000008 -1.049194 -0.000346
C  0.000004 1.930687 0.000247
C  -2.504462 -0.977759 -0.000123
C  2.504446 -0.977781 0.000028
C  -2.50989 1.862341 0.000066
C  2.509898 1.862313 0.000181
C  -3.70346 -0.24639 -0.000072
C  3.703462 -0.246434 0.000133
C  -3.731421 1.167875 0.000029
C  3.731421 1.167834 0.000207
H  -2.507419 -2.071366 -0.000241
H  2.507387 -2.071387 -0.000069
H  -2.478973 2.955822 0.000176
H  2.478992 2.955796 0.00028
H  -4.694107 1.685168 0.000085
H  4.694108 1.685122 0.000288
