program: Orca
programVersion: 4.2.1
elementType: Cl S O O O O O N N N N N N N C C C C C C C C C C C C C C C C H H H H H H H H H H H H H H H H H H
charge: 0
multiplicity: 1
keywords: wb97x-d3
keywords: def2-TZVPP
keywords: def2/J RIJCOSX GRIDX6 NOFINALGRIDX
keywords: grid4 nofinalgrid
keywords: scfconv7
keywords: smallprint printgap noloewdin
keywords: NOSOSCF
formula: C16H18ClN7O5S
InChI: InChI=1S/C16H18ClN7O5S/c1-4-5-9-6-7-10-18-13(17)14(24(10)22-9)30(26,27)23-16(25)21-15-19-11(28-2)8-12(20-15)29-3/h6-8,21,23H,4-5H2,1-3H3
48 atoms
Cl -5.174171 -0.308461 0.91732
S  -2.064332 -1.598718 -0.285532
O  -1.771737 -1.824651 -1.686019
O  -2.990565 -2.461142 0.406289
O  -1.285108 -0.980342 2.495847
O  3.078119 -1.593384 -1.968112
O  5.389749 -0.001198 1.725969
N  -1.841497 1.124588 -0.317569
N  -0.58636 1.102746 -0.739104
N  -3.793323 1.885212 0.425568
N  -0.572175 -1.633056 0.438497
N  0.926733 -0.884297 2.047841
N  1.992392 -1.280274 0.019465
N  3.152719 -0.442331 1.894988
C  -2.613585 0.02688 -0.041818
C  -0.01451 2.265954 -0.889417
C  1.398582 2.252787 -1.376672
C  -2.588127 2.2283 -0.01522
C  1.479731 2.156219 -2.901354
C  -0.692916 3.489043 -0.635854
C  -1.980246 3.479013 -0.197247
C  -3.804323 0.555767 0.418214
C  2.913116 2.002533 -3.380785
C  -0.376932 -1.155718 1.711842
C  2.069943 -0.872659 1.274571
C  3.110955 -1.227808 -0.698332
C  4.264461 -0.416423 1.172576
C  4.312142 -0.799676 -0.163279
C  1.822545 -1.919704 -2.559904
C  5.384814 0.407823 3.09198
H  1.907069 3.156574 -1.036793
H  1.921069 1.406588 -0.926435
H  1.028875 3.046974 -3.345582
H  0.883734 1.306162 -3.24287
H  -0.167834 4.421375 -0.786136
H  -2.530013 4.38286 0.021185
H  3.537922 2.833419 -3.049384
H  3.359372 1.081159 -3.001336
H  2.961514 1.966172 -4.469099
H  1.04981 -0.558386 2.997567
H  5.221724 -0.759576 -0.74408
H  1.376992 -2.80293 -2.102082
H  2.035792 -2.13406 -3.603017
H  1.124605 -1.082928 -2.507659
H  6.410636 0.685704 3.31664
H  5.080253 -0.401539 3.754349
H  4.737347 1.269273 3.251449
H  0.251539 -1.615011 -0.183462
elementType: Cl S O N C H
totalener: -2238.49894139 hartree
nucrepener: 3603.21261450 hartree
electener: -5841.71155589 hartree
twoeener: 4395.96761468 hartree
cpcmener: -0.05348137 hartree
kineticenergy: 2231.44445746 hartree
xcener: -168.725129344493 hartree
chargesum: 0.0000000
charge: -0.017548 0.872818 -0.506859 -0.486060 -0.463393 -0.296425 -0.297841 0.228804 -0.331330 -0.321821 -0.208329 -0.125006 -0.402162 -0.420893 -0.164962 0.144909 -0.090269 0.213605 -0.121279 -0.098782 -0.144133 0.144325 -0.269515 0.349311 0.354179 0.374466 0.431260 -0.303675 -0.116224 -0.115647 0.107792 0.050532 0.087782 0.079243 0.161614 0.162975 0.090052 0.068000 0.098050 0.194586 0.147228 0.128747 0.144913 0.085596 0.133251 0.114842 0.115174 0.218098
qa: -0.0175 0.8728 -0.5069 -0.4861 -0.4634 -0.2964 -0.2978 0.2288 -0.3313 -0.3218 -0.2083 -0.1250 -0.4022 -0.4209 -0.1650 0.1449 -0.0903 0.2136 -0.1213 -0.0988 -0.1441 0.1443 -0.2695 0.3493 0.3542 0.3745 0.4313 -0.3037 -0.1162 -0.1156 0.1078 0.0505 0.0878 0.0792 0.1616 0.1630 0.0901 0.0680 0.0981 0.1946 0.1472 0.1287 0.1449 0.0856 0.1333 0.1148 0.1152 0.2181
va: 1.3043 5.8864 1.9712 2.0118 2.0460 2.1111 2.1269 3.3998 2.8640 3.1306 3.0717 3.1814 2.9591 2.9685 3.8157 3.9502 3.8768 3.9864 3.8682 3.9190 4.0460 4.2445 3.9319 4.4157 4.2472 3.9855 4.0024 3.9146 3.8317 3.8452 1.0148 1.0323 1.0087 1.0048 0.9906 0.9998 1.0002 1.0084 1.0045 1.0148 1.0158 0.9948 0.9957 0.9961 0.9933 0.9953 0.9951 1.0705
dispcorr: -0.031007965 hartree
energy: -2238.529949355137
dipole: 44.88273 -39.89207 4.99066 15.81897 -12.17843 3.64054 -16.34368 15.58078 -0.76290
magnitude: 6.22432 au
magnitude: 15.82098 debye
